program: Gaussian 09
title: 000207186
version: EM64L-G09RevD.01
frameworkgroup: C1[X(C17H20ClN3O2)]
method: RPBEPBE
basis: SDD
operation: Freq
keyword: #p
keyword: freq=noraman
keyword: PBEPBE/SDD
title: #p freq=noraman PBEPBE/SDD
converged: YES YES NO NO
title: Mulliken charges:
elementType: Cl O O N N N C C C C C C C C C C C C C C C C C H H H H H H H H H H H H H H H H H H H H
charge: -0.052516 -0.246880 -0.272764 -0.096167 -0.197052 -0.040111 -0.344152 -0.337974 -0.350460 -0.378819 -0.319616 -0.313164 0.130801 0.283329 0.031917 -0.364085 0.372012 -0.784537 -0.362138 -0.355205 -0.228092 -0.220056 -0.107912 0.218340 0.223915 0.199767 0.217233 0.212178 0.193623 0.246079 0.253057 0.192595 0.216253 0.214016 0.191637 0.235813 0.253769 0.252799 0.217370 0.224806 0.276679 0.256607 0.257105
chargesum: 0.00000
title: Mulliken charges with hydrogens summed into heavy atoms:
elementType: Cl O O N N N C C C C C C C C C C C C C C C C C
charge: -0.052516 -0.246880 -0.272764 -0.096167 -0.197052 -0.040111 0.098103 0.079025 0.055341 0.120317 0.089232 0.092489 0.130801 0.283329 0.031917 -0.128272 0.372012 -0.060598 -0.137332 -0.078526 0.028514 0.037049 -0.107912
polarizability: 3.40000021e+02 4.67998162e+01 2.51358572e+02 -1.92334352e+01 1.48679508e+01 1.31243001e+02
1716.lowfreq: -18.6525 0.0015 0.0021 0.0022 2.7547 3.7371 7.1072 21.5299 25.9407
frequency: -16.4173 21.2681 25.0504 42.3688 51.4703 65.9028 81.2742 106.5562 107.0873 122.5328 170.4908 195.4105 223.5550 232.7588 241.1841 248.3200 280.5014 284.1076 317.1567 339.3883 357.2720 373.3228 388.8813 400.4081 406.3589 434.1715 445.6218 469.3451 483.9491 503.8266 513.9887 576.2987 592.3504 620.6691 627.6727 633.1309 690.0894 716.6867 746.5505 751.1937 769.7396 795.7643 812.7801 821.7586 841.1250 843.6252 894.0476 895.4773 900.5526 947.7277 952.8333 980.8518 984.2158 999.0166 1000.8767 1028.3761 1033.4946 1042.6660 1046.6102 1052.9595 1073.8599 1076.4274 1090.8535 1105.4769 1114.1206 1131.9272 1140.1919 1187.9121 1190.3402 1194.4699 1207.8212 1242.0646 1251.1024 1271.7167 1285.6755 1297.0728 1298.6669 1311.7930 1322.7921 1328.8024 1334.5622 1349.9490 1361.5977 1369.4564 1372.1686 1384.8949 1391.3344 1396.2330 1402.9587 1437.6189 1443.2699 1444.5139 1449.8885 1451.9290 1461.1685 1461.2256 1473.6214 1479.2276 1488.4773 1572.5280 1579.4359 1600.7754 1629.0449 2869.7308 2877.8213 2900.8191 2954.2250 2958.6732 2986.8433 3029.7901 3037.2247 3041.4438 3056.0538 3064.4669 3080.7141 3085.1112 3102.4715 3130.3269 3142.8454 3151.3168 3159.0176 3172.5539 3178.6648
redmass: 3.8626 4.3575 3.8992 4.9629 7.3361 3.7077 5.7205 6.6176 4.2741 1.0984 4.6299 3.8001 5.7879 2.6993 2.5690 4.4882 3.9620 4.2497 2.4397 3.2421 4.3506 3.6543 4.0662 2.2571 2.8759 6.3312 8.8945 2.8336 3.9269 3.8212 5.8643 3.0204 3.9594 3.5202 4.9553 4.3733 6.0886 3.6383 5.0847 3.7911 2.9359 1.8492 2.9849 1.3642 1.6049 1.4617 2.3913 1.4888 6.7156 1.8481 2.2937 1.4463 2.2669 3.3212 2.7872 2.2650 2.0171 3.2180 1.6557 1.9358 2.9174 2.4342 2.9236 2.1102 1.5466 2.4983 2.5367 1.3451 1.1525 1.5622 2.0702 1.5084 5.2071 1.2909 1.4073 1.3147 1.3113 1.2523 2.7528 1.3887 1.2567 1.3575 2.8517 1.5184 1.3545 2.8328 1.4345 3.4517 1.3445 1.1860 1.0832 1.0451 1.0855 1.0988 1.0972 1.1375 4.5402 1.1081 2.6469 8.0414 7.5836 6.1143 6.9326 1.0702 1.0696 1.0688 1.0665 1.0666 1.0367 1.0905 1.0905 1.0899 1.0581 1.0957 1.0964 1.0976 1.1010 1.1071 1.0909 1.0893 1.0885 1.0961 1.0973
irintensity: 0.0419 0.0560 0.0217 0.0148 1.1446 2.1619 1.8951 1.0658 2.4364 1.1601 1.2813 3.9159 0.9273 4.5544 1.5236 0.3399 0.1101 5.8674 7.1905 15.6763 2.8604 2.2877 6.7021 1.8996 0.3762 12.6668 33.0717 0.6104 5.0534 17.8717 4.3061 0.3573 4.4609 9.8709 5.5050 10.5183 15.7766 5.2900 1.7127 2.9090 6.9717 9.6709 17.1002 17.2846 1.5187 57.2558 3.2860 11.2674 21.8508 10.6713 13.4763 17.2891 66.9638 10.2074 26.0942 11.6417 24.5583 18.8293 6.8114 11.9807 39.9951 17.5197 35.3609 0.6204 9.6520 41.4087 97.2866 11.1516 0.2689 14.7856 8.5586 7.9694 20.6471 6.2772 41.4300 3.4577 3.6607 9.2003 16.0554 8.7845 4.7810 5.5140 3.1595 3.9014 9.9296 4.4578 7.2367 27.0242 24.1693 25.8207 2.4961 11.8302 0.0429 16.9016 7.8300 28.2391 4.3282 10.6948 104.3932 282.9055 16.4436 13.6546 77.1722 50.9232 81.4798 78.9687 30.5893 107.1708 11.8586 22.9511 28.5781 30.6304 20.7770 8.2913 39.8404 37.1766 14.9824 2.6081 7.7747 13.0553 0.9353 7.6243 1.4857
temp: 298.150 k
press: 1.00000 atm
elementType: 17 8 8 7 7 7 6 6 6 6 6 6 6 6 6 6 6 6 6 6 6 6 6 1 1 1 1 1 1 1 1 1 1 1 1 1 1 1 1 1 1 1 1
symmnumber: 1
zpe: 903011.6 jmol-1
zpe.correction: 0.343939 hartree
zpe.thermalcorrener: 0.364583 hartree
zpe.thermalcorrenthalpy: 0.365527 hartree
zpe.thermalcorrgfe: 0.292326 hartree
zpe.sumelectzpe: -1432.839124 hartree
zpe.sumelectthermal: -1432.818480 hartree
zpe.sumelectthermalent: -1432.817536 hartree
zpe.sumelectthermalfe: -1432.890737 hartree
dipole: -2.2170 1.2180 0.4794
dipole: 2.5746
quadrupole: -169.7486 -138.3475 -141.7951
quadrupole: -11.7116 -5.9203 4.6242
quadrupole: -19.7849 11.6162 8.1686 -11.7116 -5.9203 4.6242
hfenergy: -1433.1830632 hartree
pointgroup: C01 [X(C17H20Cl1N3O2)]
dipole: -0.9094867 0.4147746 0.1636528 debye
polarizability: 329.7650444|51.694681|261.8994961|-29.4938412|-1.2212109|130.9370531 unknown
InChI: InChI=1S/C17H20ClN3O2/c1-13-12-16(14-2-4-15(18)5-3-14)19-21(17(13)22)7-6-20-8-10-23-11-9-20/h2-5,12H,6-11H2,1H3
charge 0 multiplicity 1
43 atoms
Cl -6.516603 -3.194128 0.517544
O  6.49006 -1.624939 0.375282
O  1.538456 3.052022 -0.555363
N  3.716123 -0.82112 0.079441
N  0.441459 0.973145 -0.598465
N  -0.639178 0.144278 -0.437571
C  2.423509 -0.178908 0.395237
C  4.82416 0.152802 -0.110214
C  4.113627 -1.869986 1.054005
C  1.714523 0.280842 -0.902806
C  6.089498 -0.580703 -0.583855
C  5.384185 -2.579764 0.557124
C  0.456586 2.393529 -0.425237
C  -0.85634 2.976022 -0.110117
C  -1.82483 0.709666 -0.121118
C  -1.949999 2.139475 0.037696
C  -2.971663 -0.22483 0.037746
C  -0.910918 4.472928 0.034067
C  -4.185313 0.18249 0.655426
C  -2.867755 -1.566584 -0.42509
C  -5.265757 -0.713326 0.804186
C  -3.936041 -2.472575 -0.282832
C  -5.126121 -2.030988 0.330836
H  2.539421 0.695708 1.078882
H  1.77203 -0.915415 0.901364
H  5.048006 0.695547 0.842034
H  4.531879 0.906476 -0.86402
H  3.293443 -2.606746 1.145952
H  4.311113 -1.440765 2.068276
H  1.486315 -0.593169 -1.530876
H  2.347649 0.992423 -1.455458
H  5.903328 -1.038482 -1.579313
H  6.948632 0.107402 -0.645212
H  5.74662 -3.314041 1.295508
H  5.168056 -3.090522 -0.406166
H  -2.929563 2.574898 0.257791
H  -0.553928 4.962151 -0.89095
H  -0.224141 4.808404 0.832918
H  -1.930579 4.825509 0.261021
H  -4.301228 1.197727 1.047752
H  -1.935707 -1.887387 -0.898343
H  -6.194262 -0.392301 1.284568
H  -3.848647 -3.500763 -0.64545
