program: Gaussian 09
title: 000206066
version: EM64L-G09RevD.01
frameworkgroup: C1[X(C17H21NO2)]
method: RPBEPBE
basis: SDD
operation: Freq
keyword: #p
keyword: freq=noraman
keyword: PBEPBE/SDD
title: #p freq=noraman PBEPBE/SDD
converged: YES YES NO NO
title: Mulliken charges:
elementType: O O N C C C C C C C C C C C C C C C C C H H H H H H H H H H H H H H H H H H H H H
charge: -0.409693 -0.246381 -0.338874 0.097560 0.157363 0.326799 0.273950 -0.548413 0.386721 0.385437 -0.632958 -0.800619 -0.611298 -0.618007 -0.799126 0.485951 -0.818642 -0.819779 -0.815925 0.210138 0.259253 0.230814 0.242561 0.225842 0.240095 0.264219 0.239349 0.239340 0.239710 0.231274 0.232137 0.242299 0.251713 0.223897 0.224233 0.246558 0.243442 0.225111 0.225612 0.236908 0.371430
chargesum: 0.00000
title: Mulliken charges with hydrogens summed into heavy atoms:
elementType: O O N C C C C C C C C C C C C C C C C C
charge: -0.038262 -0.246381 -0.338874 0.097560 0.157363 0.326799 0.273950 -0.289160 0.386721 0.385437 -0.159583 -0.070464 -0.371950 -0.378666 -0.096004 0.485951 -0.100733 -0.105546 -0.128295 0.210138
polarizability: 2.55020344e+02 -1.18667819e+01 1.70429047e+02 -8.33702395e+00 -3.84330531e+00 1.61983531e+02
1716.lowfreq: -44.5695 -12.2106 -5.2101 -4.8971 0.0005 0.0006 0.0008 16.9688 21.2855
frequency: -44.3630 15.4751 21.2326 33.9201 37.5947 46.3599 58.9823 63.2768 72.6821 78.2355 92.3276 138.1338 153.4909 187.1882 192.2532 212.9647 227.0279 229.9405 267.1792 279.8569 306.7617 343.8212 359.3004 365.2172 399.7713 491.6522 493.8666 508.1818 522.3804 550.9348 558.3608 561.8030 569.5933 592.9543 618.1897 646.5420 655.9441 663.8747 724.9876 755.7897 798.2010 830.4127 846.5632 866.2899 894.5927 920.3105 935.3097 946.1508 971.1429 995.2618 1015.5598 1016.8991 1029.3058 1037.3025 1040.1747 1043.0432 1045.4709 1046.1556 1047.5387 1050.7276 1124.6935 1152.0179 1171.8115 1200.9691 1249.9325 1255.4946 1278.2420 1312.4001 1319.3960 1340.3926 1363.4206 1372.2890 1396.6875 1399.4738 1400.6688 1402.4194 1411.4708 1416.0594 1420.5031 1451.6161 1453.7996 1458.3223 1462.3602 1463.6115 1468.5862 1471.4604 1472.7691 1474.7982 1476.3126 1480.3122 1498.7162 1544.2230 1588.5432 1593.9061 1617.9565 1656.0177 2962.4097 2964.3179 2975.3260 2981.7618 2982.4572 3024.0629 3029.1787 3033.8247 3056.6401 3058.0914 3058.4430 3085.0416 3089.5139 3089.9468 3090.4203 3093.6848 3097.5049 3116.0807 3120.4736 3205.1818 3503.6214
redmass: 1.0131 2.9555 4.3144 6.5250 2.1888 2.1103 1.3557 1.3826 1.2166 2.1415 1.4574 3.2425 2.8004 3.0705 3.4104 3.6823 2.8878 3.4872 2.5147 2.5750 3.9690 3.6928 4.1027 4.4773 2.2895 3.4055 3.5087 3.1049 3.0354 4.1233 3.8199 4.0985 4.2337 2.9659 2.1435 3.1660 3.9129 2.8374 3.9786 4.0079 1.4489 3.0759 5.5143 1.3108 1.3098 1.9700 2.3126 2.8062 1.6501 4.8391 1.6684 1.5895 1.7246 1.4669 1.7697 1.6364 1.5542 1.6765 1.6234 1.6732 3.1917 1.4172 1.7167 1.3975 2.8480 1.4206 1.3627 2.8253 3.8974 5.8004 7.0429 4.0654 1.2349 1.2923 1.3119 1.2641 1.2403 2.2993 3.6084 1.1005 1.4752 1.0649 1.0631 1.0607 1.0770 1.0705 1.0614 1.2452 1.0900 1.2263 2.0129 5.0718 6.1810 7.5353 5.9760 8.2349 1.0401 1.0398 1.0386 1.0374 1.0374 1.0599 1.0975 1.0953 1.0950 1.0962 1.0964 1.0998 1.0963 1.0998 1.0996 1.1019 1.0964 1.0911 1.0919 1.0981 1.0638
irintensity: 0.4504 0.1806 0.3724 2.0346 0.1056 0.9370 0.1840 0.5409 0.0986 0.5889 0.0586 0.1329 1.5140 4.5261 0.8104 0.9504 0.0095 0.0842 1.1959 6.1698 2.8595 1.3862 1.1130 2.5133 4.0017 15.4561 2.6118 13.8193 0.0193 4.3140 23.0963 10.2592 0.8504 4.1057 59.3756 27.3627 17.0603 69.5398 5.9542 5.5911 30.4183 2.8071 26.8105 18.8151 0.0115 23.6462 0.5296 2.7967 3.1859 6.9184 12.1982 2.6534 9.0245 19.2177 1.2507 39.2813 12.7053 77.0240 49.0503 12.1593 41.8448 40.9328 2.9022 3.9268 2.2390 0.3350 4.8743 21.1718 41.5780 15.5530 3.3195 77.9482 9.3669 14.7950 14.3071 19.3545 3.0407 2.2538 21.2432 15.5174 18.1341 10.4045 35.1419 21.6439 2.7216 2.7620 10.8756 0.3243 5.7640 24.8035 98.0933 6.1225 3.3801 9.4274 14.8849 204.1071 63.7623 31.8590 39.4567 39.5376 5.9049 22.8820 16.7866 21.4761 18.5804 4.1837 26.6552 15.6564 29.8481 18.6091 22.7053 9.8278 9.0099 25.4151 16.7164 4.0292 17.1053
temp: 298.150 k
press: 1.00000 atm
elementType: 8 8 7 6 6 6 6 6 6 6 6 6 6 6 6 6 6 6 6 6 1 1 1 1 1 1 1 1 1 1 1 1 1 1 1 1 1 1 1 1 1
symmnumber: 1
zpe: 883526.5 jmol-1
zpe.correction: 0.336517 hartree
zpe.thermalcorrener: 0.358087 hartree
zpe.thermalcorrenthalpy: 0.359031 hartree
zpe.thermalcorrgfe: 0.282308 hartree
zpe.sumelectzpe: -864.160194 hartree
zpe.sumelectthermal: -864.138625 hartree
zpe.sumelectthermalent: -864.137680 hartree
zpe.sumelectthermalfe: -864.214404 hartree
dipole: 2.5997 0.6894 0.5498
dipole: 2.7452
quadrupole: -109.9618 -120.3193 -113.7688
quadrupole: -3.9789 -4.4822 -5.5754
quadrupole: 4.7215 -5.6360 0.9145 -3.9789 -4.4822 -5.5754
hfenergy: -864.4967116 hartree
pointgroup: C01 [X(C17H21N1O2)]
dipole: -1.0174802 -0.2323828 0.277944 debye
polarizability: 255.4254091|-9.4976595|171.4215562|9.0766923|2.2104839|160.5859571 unknown
InChI: InChI=1S/C17H21NO2/c1-10-6-11(2)17(12(3)7-10)18-13(4)8-15(14(18)5)9-16(19)20/h6-8,19H,9H2,1-5H3
charge 0 multiplicity 1
41 atoms
O  5.16863 0.646728 0.586497
O  4.137241 1.90234 -1.070917
N  0.083707 -0.480431 0.155279
C  -1.307054 -0.103057 0.036605
C  1.107128 -0.090989 -0.733651
C  0.618884 -1.293374 1.176759
C  2.29926 -0.67221 -0.269209
C  1.98975 -1.41642 0.926163
C  -1.766123 1.073345 0.690287
C  -2.186311 -0.91762 -0.727847
C  3.669539 -0.529287 -0.907731
C  0.845456 0.789304 -1.923667
C  -3.132671 1.420213 0.566819
C  -3.54577 -0.534498 -0.822039
C  -0.233283 -1.868758 2.272774
C  -4.037457 0.631903 -0.186246
C  -0.814967 1.931548 1.504119
C  -1.677687 -2.165891 -1.425392
C  -5.49356 1.041166 -0.326959
C  4.318942 0.791728 -0.521663
H  2.696359 -1.978674 1.535886
H  3.595382 -0.546698 -2.0092
H  4.323351 -1.356187 -0.586812
H  0.252838 0.277915 -2.708261
H  0.288481 1.704368 -1.646701
H  1.801824 1.113705 -2.364984
H  -3.497402 2.324806 1.069623
H  -4.234121 -1.159864 -1.4043
H  0.395279 -2.475229 2.945865
H  -0.723443 -1.085784 2.883804
H  -1.039496 -2.520968 1.883776
H  -0.4194 1.380382 2.377697
H  0.064775 2.238572 0.909584
H  -1.319209 2.84075 1.872624
H  -2.508635 -2.737952 -1.871617
H  -1.131148 -2.827449 -0.729084
H  -0.965222 -1.912365 -2.232751
H  -6.146338 0.166648 -0.494781
H  -5.854515 1.57036 0.572553
H  -5.632624 1.724839 -1.187116
H  5.526808 1.540884 0.840717
