program: Gaussian 09
title: 000207763
version: EM64L-G09RevD.01
frameworkgroup: C1[X(C22H27N3O5)]
method: RPBEPBE
basis: SDD
operation: Freq
keyword: #p
keyword: freq=noraman
keyword: PBEPBE/SDD
title: #p freq=noraman PBEPBE/SDD
converged: NO YES NO NO
title: Mulliken charges:
elementType: O O O O O N N N C C C C C C C C C C C C C C C C C C C C C C H H H H H H H H H H H H H H H H H H H H H H H H H H H
charge: -0.275719 -0.296033 -0.286580 -0.292581 -0.298091 -0.139011 -0.410976 -0.691817 -0.043508 -0.420508 -0.498427 -0.407003 -0.393434 0.102193 0.130210 0.285115 0.378324 -0.382948 -0.332628 -0.522272 -0.554874 -0.415989 -0.430653 0.298776 0.226904 0.504557 0.049243 -0.534075 -0.526423 -0.516328 0.257096 0.192256 0.260921 0.215139 0.271673 0.207604 0.233858 0.264381 0.209609 0.338666 0.273233 0.248016 0.257416 0.287841 0.222926 0.219996 0.308449 0.309613 0.226838 0.234907 0.241046 0.268974 0.211936 0.223336 0.220667 0.260575 0.227582
chargesum: 0.00000
title: Mulliken charges with hydrogens summed into heavy atoms:
elementType: O O O O O N N N C C C C C C C C C C C C C C C C C C C C C C
charge: -0.275719 -0.296033 -0.286580 -0.292581 -0.298091 -0.139011 -0.072310 -0.073756 0.213589 0.032669 -0.011615 0.034459 0.080557 0.102193 0.130210 0.285115 0.378324 -0.109714 -0.084612 -0.264856 -0.267032 -0.193063 -0.210658 0.298776 0.226904 0.504557 0.049243 0.168716 0.177823 0.192495
polarizability: 3.12993628e+02 1.12587186e+01 3.44081794e+02 2.14039498e+01 5.87854624e-01 2.11708455e+02
1716.lowfreq: -4.8535 -0.0007 -0.0005 0.0004 3.5463 5.3963 10.6632 16.6457 24.4700
frequency: 8.5382 14.7299 24.4495 38.0973 49.5016 59.0202 62.5070 66.2906 73.4973 75.7106 82.8498 99.7943 108.4750 134.6836 142.5169 153.4366 162.5083 176.5790 185.0382 207.6698 216.0329 224.5444 240.8239 249.7907 276.5782 282.1666 294.0951 302.2190 322.1634 339.3464 358.0197 364.6069 378.2421 387.8112 398.2433 402.5106 408.1424 416.1345 443.8513 459.3352 477.0044 488.8270 504.2205 530.5247 545.3411 567.5129 574.3207 577.8812 602.6561 630.6301 637.6983 651.3320 681.4155 691.7597 695.7818 738.6431 752.1052 756.1730 771.6558 810.9025 822.5015 827.7568 838.4754 855.2847 861.1958 864.6396 875.6909 884.8126 891.9655 906.3963 942.8282 952.1808 958.7388 970.6345 987.4381 996.4735 1004.0550 1013.8150 1020.4782 1043.2263 1064.6000 1091.9163 1102.1520 1106.8557 1108.3310 1110.8045 1112.6275 1113.6874 1132.4144 1149.4893 1153.8430 1159.9690 1171.1633 1185.8324 1189.7088 1194.7508 1215.2525 1226.1889 1237.7468 1262.2662 1272.8520 1286.8923 1306.3409 1309.7210 1320.8125 1330.2869 1333.1847 1344.3655 1359.1582 1363.3555 1374.2576 1379.1300 1397.2108 1401.3146 1416.5338 1433.5227 1438.6196 1443.3065 1448.3259 1450.5595 1456.3187 1457.7128 1462.3725 1465.4306 1466.0772 1469.1920 1476.9639 1481.3954 1485.7531 1493.8661 1516.1027 1540.1184 1562.1744 1576.1054 1595.6143 1598.8218 1629.3795 1645.4568 2967.4652 2969.6137 2971.7005 2976.4769 2981.9647 2984.4350 2996.1343 3030.8828 3053.6835 3061.4656 3063.8655 3080.3216 3088.2979 3094.4291 3104.9781 3117.9795 3123.7915 3124.1237 3126.6359 3127.2515 3142.7013 3150.5771 3153.8383 3167.1554 3540.9805 3563.9504 3703.8310
redmass: 5.1264 5.3204 6.0740 5.6542 4.7019 3.8861 5.3348 2.7878 2.2734 3.1772 3.9946 3.0489 3.9601 1.8369 1.7944 2.6072 2.7200 2.9515 3.4683 2.8056 3.0081 3.5332 2.8303 3.6534 2.0821 5.6534 5.0160 4.1708 5.9431 3.1144 3.6029 4.0223 2.6477 1.1866 1.1086 5.2043 2.5316 2.8298 3.3659 3.6562 2.8627 5.5990 3.1739 6.1438 2.1356 2.0624 3.0722 5.2108 4.4614 6.8251 4.3828 4.4920 4.9870 5.4571 2.6092 4.9066 4.4940 4.9112 4.6316 3.9355 1.3367 3.6810 1.9064 2.2900 1.6850 4.0885 1.7438 2.6134 1.7818 3.5605 3.4738 8.3648 1.3603 1.3618 3.6673 2.8025 2.5781 2.5389 1.5117 2.1552 6.4491 2.0953 1.4425 1.9153 1.2977 1.2480 1.2584 2.4012 1.2326 1.4011 1.4292 1.4479 2.1211 1.5770 1.5740 1.6382 1.5786 2.3725 1.5173 2.0252 1.6068 1.6104 2.3753 1.3415 2.7844 1.5800 1.3239 1.5306 1.3756 1.4323 5.6405 4.4758 2.7323 2.2448 1.2793 1.3065 3.9371 1.2811 1.1428 1.3248 1.0738 1.1225 1.3625 1.1163 1.0522 1.1378 1.1324 1.0566 1.0691 2.5560 3.1539 7.4778 7.5842 6.9612 8.1306 6.3221 3.5338 1.3652 1.0686 1.0322 1.0343 1.0659 1.0315 1.0685 1.0608 1.0856 1.0992 1.1042 1.0996 1.0976 1.1016 1.0948 1.0943 1.0873 1.1044 1.0888 1.1041 1.1010 1.0959 1.0918 1.0961 1.0907 1.0771 1.0450 1.1040
irintensity: 0.2784 0.9095 1.8608 2.7893 2.6618 3.3094 2.9764 2.7473 6.8869 6.3198 1.9481 0.4611 7.5754 2.6893 2.6969 1.8808 5.3461 1.8765 0.6135 2.0088 13.4309 9.8707 3.5102 1.3220 1.3250 5.0500 4.9062 1.0663 0.4194 0.7932 3.3555 11.3208 5.1522 219.4833 75.0889 13.9670 8.8230 1.2165 0.1247 15.5937 9.6267 3.1607 9.7533 3.5224 54.5415 30.0500 6.9260 10.3891 5.0114 1.1757 1.4622 8.7755 29.3409 22.0112 1.7354 19.2234 7.0747 11.3987 4.2467 7.3713 3.3286 6.0979 80.9910 11.7422 19.7423 11.5473 7.8710 9.4629 25.8819 0.0999 18.5053 58.7205 0.8256 1.9973 20.8969 20.9946 21.8826 15.5420 0.2393 7.3695 248.2923 49.5482 10.1194 16.8197 7.4783 2.5274 0.0840 17.0435 18.8534 2.2146 18.9414 27.8164 10.2653 87.0714 59.3898 1.8438 30.8140 14.0088 3.7986 179.5709 33.8224 49.2106 209.5020 2.6589 79.9078 64.9428 2.4740 42.5151 22.0798 56.8285 11.0330 3.7094 9.8058 215.3912 18.8003 21.9595 7.7330 11.8310 27.8245 215.5629 6.6666 41.4360 168.8416 51.8216 14.6408 14.0453 27.3493 8.5284 18.8865 201.7721 56.1354 125.8149 254.3439 40.6821 23.9116 7.7762 107.1176 328.1398 47.4628 63.0634 73.0666 20.5781 82.4102 65.7991 32.9181 25.6980 48.4439 37.3400 41.7077 34.0570 30.6615 4.9642 12.0291 13.5965 13.7612 18.7785 15.6425 28.4324 19.6112 1.0071 3.9944 4.6255 30.0963 93.8240 21.3569
temp: 298.150 k
press: 1.00000 atm
elementType: 8 8 8 8 8 7 7 7 6 6 6 6 6 6 6 6 6 6 6 6 6 6 6 6 6 6 6 6 6 6 1 1 1 1 1 1 1 1 1 1 1 1 1 1 1 1 1 1 1 1 1 1 1 1 1 1 1
symmnumber: 1
zpe: 1209677.3 jmol-1
zpe.correction: 0.460742 hartree
zpe.thermalcorrener: 0.490835 hartree
zpe.thermalcorrenthalpy: 0.491780 hartree
zpe.thermalcorrgfe: 0.396697 hartree
zpe.sumelectzpe: -1392.674075 hartree
zpe.sumelectthermal: -1392.643981 hartree
zpe.sumelectthermalent: -1392.643037 hartree
zpe.sumelectthermalfe: -1392.738120 hartree
dipole: 0.3597 2.2670 -3.1705
dipole: 3.9142
quadrupole: -149.2082 -145.3158 -186.1509
quadrupole: -5.2513 24.9479 -14.7638
quadrupole: 11.0168 14.9092 -25.9260 -5.2513 24.9479 -14.7638
hfenergy: -1393.1348167 hartree
pointgroup: C01[X(C22H27N3O5)]
dipole: 0.388787 -0.9885525 1.1149212 debye
polarizability: 312.4401499|-12.1783786|338.7130558|-31.9515244|12.2742124|217.6306709 unknown
InChI: InChI=1S/C22H27N3O5/c1-28-18-11-15(12-19(29-2)20(18)30-3)21(26)24-17-5-4-10-25(13-17)22(27)14-6-8-16(23)9-7-14/h6-9,11-12,17,24H,4-5,10,13,23H2,1-3H3
charge 0 multiplicity 1
57 atoms
O  -3.275878 0.09462 -2.340632
O  0.687997 2.87235 1.979592
O  5.323844 1.612795 0.021764
O  2.277679 -1.920433 -1.419538
O  4.904225 -0.817882 -1.309135
N  -3.588121 1.102567 -0.260365
N  -0.794885 1.635476 0.689061
N  -2.347144 -5.220139 1.185159
C  -1.996324 2.255917 1.277919
C  -2.347776 3.611574 0.606035
C  -3.183319 1.263436 1.155174
C  -2.827702 3.410854 -0.850126
C  -3.975576 2.375938 -0.918476
C  -3.300973 -0.011359 -1.068251
C  0.481451 1.964779 1.106693
C  -3.044289 -1.333606 -0.405547
C  1.611234 1.20009 0.466395
C  -2.055435 -2.186143 -0.966289
C  -3.817556 -1.827184 0.679427
C  1.438844 -0.052026 -0.166055
C  2.902201 1.774303 0.550748
C  -1.810343 -3.463395 -0.438279
C  -3.600602 -3.113843 1.201964
C  4.008615 1.121486 -0.027686
C  2.543452 -0.71036 -0.752064
C  -2.579786 -3.951162 0.660567
C  3.837719 -0.118763 -0.720271
C  5.548358 2.849074 0.780242
C  3.071625 -3.099956 -1.009179
C  5.682165 -0.098475 -2.3441
H  -1.773922 2.434099 2.346357
H  -3.150177 4.094251 1.201667
H  -1.46537 4.273669 0.651959
H  -4.038555 1.663085 1.735949
H  -2.896982 0.289427 1.577571
H  -3.174737 4.37141 -1.275442
H  -1.990454 3.059736 -1.482618
H  -4.23562 2.143968 -1.963097
H  -4.872575 2.770983 -0.398169
H  -0.921491 0.992936 -0.095194
H  -1.490432 -1.835582 -1.837003
H  -4.6267 -1.213979 1.093226
H  0.477225 -0.574379 -0.198149
H  2.99667 2.719142 1.093055
H  -1.027973 -4.093524 -0.878337
H  -4.224339 -3.482215 2.025561
H  -2.898245 -5.573487 1.961901
H  -1.634599 -5.825044 0.787387
H  5.001277 3.700584 0.332542
H  5.243417 2.727215 1.836564
H  6.632078 3.027321 0.721112
H  4.149191 -2.914557 -1.146526
H  2.858116 -3.35079 0.048241
H  2.73026 -3.915433 -1.665355
H  5.016647 0.216939 -3.169441
H  6.193647 0.77408 -1.906542
H  6.413744 -0.834485 -2.710766
