program: Gaussian 09
title: 000018514
version: EM64L-G09RevD.01
frameworkgroup: C1[X(C18H18N2O6)]
method: RPBEPBE
basis: SDD
operation: Freq
keyword: #p
keyword: freq=noraman
keyword: PBEPBE/SDD
title: #p freq=noraman PBEPBE/SDD
converged: YES YES NO NO
title: Mulliken charges:
elementType: O O O O O O N N C C C C C C C C C C C C C C C C C C H H H H H H H H H H H H H H H H H H
charge: -0.277490 -0.492125 -0.367720 -0.395062 -0.423996 -0.433630 -0.390784 -0.422276 0.103070 0.177638 0.254001 0.276542 0.200820 0.142385 -0.151346 0.024996 -0.379306 -0.399440 0.129613 0.075777 -0.378408 -0.357148 -0.381964 -0.351976 -0.358706 -0.351791 0.242735 0.237762 0.407604 0.394617 0.211417 0.214381 0.228545 0.214948 0.220403 0.260852 0.195406 0.235264 0.226125 0.199914 0.353144 0.398999 0.337554 0.348654
chargesum: 0.00000
title: Mulliken charges with hydrogens summed into heavy atoms:
elementType: O O O O O O N N C C C C C C C C C C C C C C C C C C
charge: -0.277490 -0.492125 -0.014577 0.003937 -0.086442 -0.084976 0.016820 -0.027659 0.103070 0.177638 0.254001 0.276542 0.200820 0.142385 -0.151346 0.024996 -0.136570 -0.161678 0.129613 0.075777 0.047390 0.086346 -0.161561 -0.091124 0.071965 0.074249
polarizability: 3.30332255e+02 5.26964797e+00 4.48096781e+02 1.30685662e+01 1.09818898e+01 1.16239717e+02
1716.lowfreq: -5.5365 -1.1458 -0.0006 -0.0003 0.0002 3.1782 24.0313 29.1294 35.9210
frequency: 24.0181 29.1171 35.9090 47.9256 57.3270 66.3233 94.4744 96.8669 116.5021 131.7195 144.1616 166.0374 184.2483 196.2218 224.3668 240.8432 271.3624 282.7575 286.8170 302.5568 335.8039 349.0061 354.2643 359.5978 391.2508 391.6567 405.8012 411.3322 426.2916 433.1385 450.5377 457.0439 481.9299 497.2718 505.4217 507.6396 516.5016 539.1929 592.3411 619.7701 633.4181 664.6832 703.5419 724.9732 744.9424 752.9606 799.3296 807.5708 810.2415 813.4625 828.6753 852.4542 856.9671 860.2284 879.6851 884.0855 887.4338 930.0292 935.3725 947.0460 963.2504 977.9547 991.5904 1018.8354 1022.8586 1058.8996 1081.2568 1084.9482 1121.0725 1128.4018 1148.9346 1168.7714 1176.5132 1188.5107 1202.1961 1225.9815 1241.6167 1249.3161 1262.5784 1270.8755 1285.4180 1300.3666 1314.8226 1321.3063 1330.6900 1345.9293 1353.4768 1366.2518 1367.3069 1382.1778 1384.7751 1387.1839 1407.9460 1432.9813 1444.8106 1457.4584 1461.9232 1463.8294 1469.2451 1471.5067 1482.8262 1512.4555 1539.0732 1551.7689 1569.5467 1597.4026 1628.8401 1643.5362 2600.1377 2905.2790 2936.6384 2954.4916 2964.2670 2976.8966 3029.6911 3087.3053 3089.2422 3101.6254 3108.0748 3113.2697 3150.1685 3172.9342 3179.2603 3524.3336 3548.6286 3556.0689
redmass: 5.4156 6.7565 5.3829 4.3187 7.0355 5.5651 4.1542 4.5247 3.7012 3.5091 6.3938 6.2435 5.1188 6.9627 3.7103 2.4579 4.7459 3.7145 5.1337 2.5213 1.4080 1.7254 4.7274 4.0375 2.3537 1.1679 6.3956 9.0466 6.7459 8.5504 4.0672 8.5632 4.9162 5.0852 5.6439 4.2740 4.7695 3.6716 3.2361 4.7754 4.9418 5.7070 7.2135 6.7442 6.2368 5.7644 5.0686 1.8361 1.8379 2.9603 11.2366 2.5757 1.3541 1.3051 1.8430 2.0436 2.4490 1.3430 6.0323 1.3513 3.1218 3.9405 1.0701 1.5398 3.2358 2.6054 2.3696 2.0449 2.3330 2.1356 1.9578 1.4347 1.2779 1.6536 1.4336 1.1911 2.1866 1.2724 1.6347 3.7481 3.3902 2.2372 3.4009 1.2838 1.3144 1.8219 2.3993 1.6713 2.0809 1.2716 1.7396 2.0244 7.8744 5.8982 3.7615 1.4700 1.4606 1.1387 1.2966 1.1028 2.6440 3.9837 4.2161 2.7662 3.2305 3.5981 2.6584 6.8043 1.0706 1.0648 1.0662 1.0703 1.0766 1.0861 1.0939 1.0958 1.0946 1.0827 1.0822 1.0900 1.0861 1.0962 1.0949 1.0655 1.0659 1.0662
irintensity: 0.9020 1.4350 2.2503 6.0357 4.1185 0.4078 3.3557 0.6966 0.8701 1.7568 1.5203 3.9862 8.0093 1.8176 1.2411 12.6203 10.7880 7.0388 3.2492 84.6789 244.1105 7.6995 1.8991 10.0992 40.0210 112.4925 6.0121 0.7912 0.5042 18.5191 6.8774 9.8152 9.8666 2.7040 5.8708 34.4948 2.2270 22.1828 0.6913 10.8392 10.2777 0.8562 2.5918 0.2336 8.9719 19.1147 23.5307 4.8827 88.7527 15.8416 0.8531 18.8360 39.9067 54.9318 48.9957 13.6969 51.7264 2.7925 58.0923 0.3885 24.4157 31.1299 138.0679 71.9692 88.8902 17.6847 32.1921 13.9765 13.1527 65.8314 9.3636 42.5906 8.3191 65.7159 52.0533 37.1821 20.1427 115.3124 200.8948 249.2118 24.8154 189.6283 293.2329 25.3283 7.2656 126.2531 115.3631 4.1638 4.8120 43.3835 35.0350 42.1685 23.0201 31.5290 68.7329 25.5006 191.9995 1.8727 10.2297 93.0467 60.8678 3.3583 593.4778 56.1362 85.4563 196.9757 92.0852 103.6943 169.8754 127.4315 98.2205 64.8018 47.0179 123.7829 36.2545 22.7691 45.2283 10.9659 20.1330 21.1617 7.0605 20.3529 6.4764 40.9314 3.8674 6.1079
temp: 298.150 k
press: 1.00000 atm
elementType: 8 8 8 8 8 8 7 7 6 6 6 6 6 6 6 6 6 6 6 6 6 6 6 6 6 6 1 1 1 1 1 1 1 1 1 1 1 1 1 1 1 1 1 1
symmnumber: 1
zpe: 880451.4 jmol-1
zpe.correction: 0.335346 hartree
zpe.thermalcorrener: 0.358952 hartree
zpe.thermalcorrenthalpy: 0.359896 hartree
zpe.thermalcorrgfe: 0.281207 hartree
zpe.sumelectzpe: -1255.698162 hartree
zpe.sumelectthermal: -1255.674556 hartree
zpe.sumelectthermalent: -1255.673612 hartree
zpe.sumelectthermalfe: -1255.752302 hartree
dipole: 1.7526 -4.0036 -2.0702
dipole: 4.8359
quadrupole: -167.0750 -112.6170 -152.9762
quadrupole: -1.3773 6.5789 9.4649
quadrupole: -22.8523 31.6057 -8.7535 -1.3773 6.5789 9.4649
hfenergy: -1256.0335081 hartree
pointgroup: C01 [X(C18H18N2O6)]
dipole: -0.7056034 1.5876008 -0.775576 debye
polarizability: 330.1125131|4.6501086|448.4975971|-14.0549479|-3.728816|116.0586433 unknown
InChI: InChI=1S/C18H18N2O6/c21-7-5-19-9-1-2-10(20-6-8-22)14-13(9)17(25)15-11(23)3-4-12(24)16(15)18(14)26/h1-4,19-24H,5-8H2
charge 0 multiplicity 1
44 atoms
O  -2.775876 -0.72186 0.128153
O  2.747925 -0.791053 -0.336557
O  -2.790094 -3.361591 0.176142
O  2.80593 -3.259804 -0.314506
O  -5.697045 1.82016 -0.31161
O  5.213465 2.30127 1.415151
N  -2.799466 1.834153 0.147026
N  2.83127 1.759732 -0.346604
C  -0.722688 0.523677 -0.047016
C  0.716507 0.519163 -0.171651
C  -1.43162 1.780974 0.003069
C  1.456251 1.761232 -0.250591
C  -0.745245 -2.024992 -0.017698
C  0.689938 -2.011078 -0.142229
C  -1.483799 -0.73994 0.028113
C  1.418888 -0.749033 -0.218843
C  -0.666757 2.997293 -0.107973
C  0.715328 2.99072 -0.230737
C  -1.399704 -3.289717 0.05404
C  1.437512 -3.239744 -0.19412
C  -3.579259 3.069308 0.184202
C  3.686323 2.947238 -0.448523
C  -0.640211 -4.493923 0.002244
C  0.752896 -4.478082 -0.120036
C  -5.037337 2.779364 0.580225
C  5.120583 2.588212 -0.018398
H  -1.188581 3.958535 -0.107116
H  1.244689 3.942464 -0.327294
H  -3.264232 0.895433 0.149019
H  3.229712 0.796552 -0.44084
H  -3.557185 3.587136 -0.803178
H  -3.159514 3.779579 0.928117
H  3.317916 3.745667 0.222771
H  3.697289 3.35125 -1.485072
H  -1.163642 -5.457837 0.059766
H  1.337142 -5.400977 -0.160444
H  -5.594283 3.738983 0.629813
H  -5.07417 2.295873 1.570309
H  5.784906 3.451999 -0.181385
H  5.497974 1.735768 -0.624739
H  -3.07289 -4.312563 0.211221
H  3.09876 -2.25416 -0.35226
H  -5.699314 2.173613 -1.237562
H  4.583509 1.567005 1.633601
