program: Gaussian 09
title: 000200421
version: EM64L-G09RevD.01
frameworkgroup: C1[X(C14H9F4NO)]
method: RPBEPBE
basis: SDD
operation: Freq
keyword: #p
keyword: freq=noraman
keyword: PBEPBE/SDD
title: #p freq=noraman PBEPBE/SDD
converged: YES YES NO NO
title: Mulliken charges:
elementType: F F F F O N C C C C C C C C C C C C C C H H H H H H H H H
charge: -0.162470 -0.167995 -0.168725 -0.226670 -0.269725 -0.495694 0.521996 0.347937 -0.552948 -0.343903 0.051985 -0.403388 0.169729 -0.192842 0.247613 0.237266 -0.292746 -0.346360 -0.235866 -0.191184 0.258260 0.356105 0.318604 0.267482 0.237556 0.287124 0.263179 0.241706 0.243974
chargesum: 0.00000
title: Mulliken charges with hydrogens summed into heavy atoms:
elementType: F F F F O N C C C C C C C C C C C C C C
charge: -0.162470 -0.167995 -0.168725 -0.226670 -0.269725 -0.139589 0.521996 0.347937 -0.294688 -0.025298 0.051985 -0.135906 0.169729 0.044714 0.247613 0.237266 -0.005622 -0.083181 0.005840 0.052790
polarizability: 2.78305881e+02 1.31580571e+01 1.72074055e+02 -3.80215666e-01 1.99542402e-01 6.91379520e+01
1716.lowfreq: -14.7725 -0.0009 -0.0001 0.0007 2.4540 2.7102 5.2160 22.5511 45.4691
frequency: -14.3716 22.0858 45.3396 61.4169 74.5851 128.4617 140.1653 144.6784 206.1950 232.7457 252.8884 274.3416 302.9256 309.6499 335.9353 361.7535 396.9564 428.8941 438.0503 486.3213 504.6051 512.3481 513.7588 525.1713 579.1947 610.7178 622.4726 650.3266 667.8319 695.4940 704.7281 731.9988 759.8584 778.4893 781.5139 816.6921 864.5882 873.4115 876.8031 892.9010 940.4361 968.6363 982.3602 983.6660 1004.7727 1007.3296 1010.0858 1027.2320 1054.5064 1073.1580 1106.6940 1115.7018 1155.2212 1171.9252 1187.6921 1220.7138 1246.9719 1271.1615 1310.6657 1320.0976 1382.7170 1389.1164 1424.5636 1435.6635 1463.5062 1487.8107 1541.4521 1568.4024 1599.7294 1615.1710 1619.7234 1630.7291 3133.7173 3146.6913 3151.1608 3158.4894 3171.5109 3179.8354 3183.5798 3199.6141 3479.8865
redmass: 15.6969 7.3310 5.9278 8.8668 6.9999 6.4986 5.6687 9.3340 8.4439 5.2296 8.1686 4.5474 6.6726 9.2984 10.2197 9.8476 8.3874 4.2006 4.3675 4.4171 7.7867 9.7709 4.0943 9.1090 7.3876 10.9153 5.7607 6.8351 4.3298 2.1116 8.4206 1.6403 1.9816 1.4438 7.1108 1.3654 6.1608 7.7845 1.4086 1.6368 1.4097 1.3519 9.0571 6.1578 1.3337 5.9857 1.3247 2.4754 4.2362 3.4884 1.7184 1.8389 2.0231 1.2216 1.0917 2.3376 1.8627 1.8069 2.3452 1.9325 8.2427 5.8016 3.5147 2.6127 2.5634 2.8871 2.4830 5.3358 8.2792 4.6503 5.2381 4.3604 1.0926 1.0865 1.0890 1.0908 1.0956 1.0953 1.0998 1.0955 1.0777
irintensity: 0.0919 0.0948 3.2109 0.5954 5.4693 0.5977 0.0017 4.0252 3.6502 0.5898 6.8676 0.7055 0.0578 1.8623 5.9055 5.1533 4.7715 0.0091 1.1186 14.6606 10.9821 11.5007 1.5604 8.6225 22.9195 10.1084 5.8403 0.6238 4.3107 17.0213 0.9162 14.9597 106.3990 52.3872 16.7970 71.3395 37.4748 1.9497 0.0115 59.3524 4.9031 2.4030 219.2857 15.3737 0.5925 144.0219 3.2744 53.1348 71.4362 102.3053 0.1150 15.6639 16.1008 15.5904 0.5768 83.3841 81.7877 96.7687 145.0636 192.5906 0.6507 40.2951 1.8194 49.1075 29.6197 168.1438 490.4947 21.2493 55.6950 78.7272 37.6095 36.0608 3.2419 3.5031 9.1589 1.9699 11.3295 2.7208 10.5569 8.8078 86.3924
temp: 298.150 k
press: 1.00000 atm
elementType: 9 9 9 9 8 7 6 6 6 6 6 6 6 6 6 6 6 6 6 6 1 1 1 1 1 1 1 1 1
symmnumber: 1
zpe: 524732.3 jmol-1
zpe.correction: 0.199860 hartree
zpe.thermalcorrener: 0.215751 hartree
zpe.thermalcorrenthalpy: 0.216695 hartree
zpe.thermalcorrgfe: 0.155039 hartree
zpe.sumelectzpe: -1066.859090 hartree
zpe.sumelectthermal: -1066.843199 hartree
zpe.sumelectthermalent: -1066.842255 hartree
zpe.sumelectthermalfe: -1066.903911 hartree
dipole: -5.2460 0.0440 -0.0130
dipole: 5.2462
quadrupole: -99.6805 -111.3012 -118.8582
quadrupole: 17.7461 -0.2604 0.0544
quadrupole: 10.2661 -1.3546 -8.9115 17.7461 -0.2604 0.0544
hfenergy: -1067.0589496 hartree
pointgroup: C01 [X(C14H9F4N1O1)]
dipole: -2.0626974 0.0194528 0.0713727 debye
polarizability: 278.0333978|13.1126643|172.0185205|-7.89815|1.2707802|69.4659699 unknown
InChI: InChI=1S/C14H9F4NO/c15-12-7-2-1-6-11(12)13(20)19-10-5-3-4-9(8-10)14(16,17)18/h1-8,19H
charge 0 multiplicity 1
29 atoms
F  5.5888 -0.458034 -0.262605
F  4.279916 -1.790867 1.024424
F  4.103364 -1.876843 -1.22794
F  -1.980678 -2.100888 0.042631
O  -1.682392 2.203904 0.119526
N  -0.491624 0.185521 0.036278
C  0.843448 0.664802 -0.005207
C  3.22435 0.093538 -0.100345
C  1.873191 -0.309277 -0.058435
C  1.185873 2.046617 0.004921
C  -2.961125 0.153471 0.136139
C  3.57504 1.462304 -0.090372
C  -1.664258 0.934399 0.096035
C  2.543267 2.423967 -0.038348
C  4.28089 -0.972404 -0.142535
C  -3.127462 -1.250607 0.112907
C  -4.157522 0.9193 0.206422
C  -4.370683 -1.895878 0.15447
C  -5.425565 0.309634 0.250087
C  -5.536229 -1.101403 0.22424
H  1.621925 -1.376665 -0.068071
H  -0.604974 -0.833592 0.02322
H  0.390063 2.791677 0.045877
H  4.625213 1.764052 -0.124082
H  2.798695 3.488505 -0.030959
H  -4.040394 2.007711 0.225026
H  -4.412959 -2.988344 0.132382
H  -6.325743 0.92949 0.304137
H  -6.518227 -1.583788 0.257977
