program: Gaussian 09
title: 000199230
version: EM64L-G09RevD.01
frameworkgroup: C1[X(C10H16N2O)]
method: RPBEPBE
basis: SDD
operation: Freq
keyword: #p
keyword: freq=noraman
keyword: PBEPBE/SDD
title: #p freq=noraman PBEPBE/SDD
converged: YES YES NO NO
title: Mulliken charges:
elementType: O N N C C C C C C C C C C H H H H H H H H H H H H H H H H
charge: -0.267190 -0.144221 -0.082138 -0.442919 -0.353989 -0.518033 0.197253 -0.442407 0.020683 -0.412780 -0.017919 -0.623159 -0.612704 0.238051 0.226824 0.249832 0.219260 0.251754 0.240799 0.277281 0.244028 0.211993 0.235928 0.254719 0.185316 0.222931 0.224128 0.229498 0.187180
chargesum: 0.00000
title: Mulliken charges with hydrogens summed into heavy atoms:
elementType: O N N C C C C C C C C C C
charge: -0.267190 -0.144221 -0.082138 0.021955 0.115103 -0.025480 0.197253 0.078903 0.020683 0.035141 -0.017919 0.039807 0.028102
polarizability: 1.56804534e+02 -6.75613152e+00 1.06844084e+02 8.89167569e+00 -2.99020369e+00 1.03953351e+02
1716.lowfreq: -13.3542 -7.6827 -0.0007 -0.0006 -0.0003 6.5803 13.3590 29.2344 43.0277
frequency: 2.8510 28.6679 42.8323 78.0717 92.7720 151.4849 156.8877 212.7286 223.3910 232.4540 237.7586 265.4626 302.8524 312.6517 348.3207 368.6334 405.2020 478.3894 540.1860 560.1248 627.0118 639.4962 747.7366 789.1481 809.5816 847.8609 889.8818 920.4046 943.1593 966.7000 1012.5223 1032.8071 1034.2200 1041.3536 1076.4686 1091.2268 1132.1742 1150.5738 1160.3660 1170.7260 1192.8080 1198.9179 1211.1710 1249.1961 1258.5950 1262.6232 1277.0843 1286.3337 1317.8312 1349.6720 1351.8514 1404.1153 1417.8139 1439.3075 1452.6968 1453.9385 1458.8418 1459.5208 1471.7070 1476.0410 1479.6338 1484.7849 1501.4325 1638.0554 2284.2381 2807.6748 2845.7256 2862.8178 2949.4622 2956.3597 2998.6980 3010.3331 3017.4734 3020.1284 3024.9385 3034.0982 3046.7409 3080.7291 3085.7655 3094.7713 3099.8297
redmass: 3.1282 4.6157 3.3070 3.0896 3.6484 2.7424 2.0536 2.8596 2.9057 1.1642 1.2528 2.4935 3.8174 2.2904 2.7387 4.5600 2.9250 4.1144 2.8119 4.6042 3.3906 6.4340 2.6636 4.6990 4.1044 2.0258 1.4736 2.1039 2.1865 1.6904 2.5097 2.0047 1.5899 3.3443 1.6953 1.2575 1.3731 2.3735 1.4358 1.8214 1.6305 1.5540 1.3782 2.1955 2.2284 1.7113 1.3842 1.4846 1.3523 1.5304 1.4081 2.3518 1.1405 1.1631 1.0768 1.0888 1.0815 1.0467 1.0603 1.0555 1.0927 1.0534 1.1016 10.5207 11.7469 1.0704 1.0575 1.0569 1.0635 1.0672 1.0842 1.0651 1.0946 1.0720 1.0658 1.0727 1.0931 1.1008 1.0990 1.1008 1.1031
irintensity: 2.1755 1.0664 3.5954 1.0427 0.6701 3.9090 1.4998 10.5067 1.0616 2.0135 5.0162 6.4434 6.4612 12.3356 1.4123 0.2271 0.9039 6.9344 1.2599 2.4013 10.0795 8.5576 2.2631 8.2197 23.1432 11.1439 2.8758 5.1014 7.9363 1.6318 34.0392 28.5900 4.7377 4.2377 0.7375 7.1060 6.2658 10.9426 3.8241 6.4072 20.0288 8.7357 31.2002 12.7571 158.7062 4.1006 9.6147 24.2185 5.6934 38.4970 19.8656 61.4286 3.9436 5.5491 3.3956 7.1423 23.0201 14.2614 10.5115 17.6222 10.5331 15.0789 3.2064 343.4028 0.1106 73.6523 90.7461 208.2961 29.3110 75.7272 23.1051 20.7828 9.1252 41.8914 21.6632 34.7362 26.0411 29.5167 13.2256 28.8801 35.7621
temp: 298.150 k
press: 1.00000 atm
elementType: 8 7 7 6 6 6 6 6 6 6 6 6 6 1 1 1 1 1 1 1 1 1 1 1 1 1 1 1 1
symmnumber: 1
zpe: 642627.3 jmol-1
zpe.correction: 0.244764 hartree
zpe.thermalcorrener: 0.259337 hartree
zpe.thermalcorrenthalpy: 0.260282 hartree
zpe.thermalcorrgfe: 0.199317 hartree
zpe.sumelectzpe: -574.304228 hartree
zpe.sumelectthermal: -574.289655 hartree
zpe.sumelectthermalent: -574.288711 hartree
zpe.sumelectthermalfe: -574.349675 hartree
dipole: -2.0690 2.7428 -2.4596
dipole: 4.2253
quadrupole: -71.3566 -81.5595 -77.7068
quadrupole: 11.3049 -6.8998 4.1581
quadrupole: 5.5177 -4.6852 -0.8325 11.3049 -6.8998 4.1581
hfenergy: -574.5489923 hartree
pointgroup: C01 [X(C10H16N2O1)]
dipole: 0.6492748 -1.156947 1.0016981 debye
polarizability: 153.9046141|-12.6679597|106.3184095|9.721748|-4.8200059|107.378946 unknown
InChI: InChI=1S/C10H16N2O/c1-11(2)7-3-4-8-12-9-5-6-10(12)13/h5-9H2,1-2H3
charge 0 multiplicity 1
29 atoms
O  -2.839591 1.527926 -1.758623
N  -1.938859 -0.313368 -0.591598
N  3.354622 0.016045 0.711219
C  -2.972225 -0.086015 1.533901
C  -2.131099 -1.06567 0.662839
C  -3.687641 0.829582 0.506398
C  -2.801149 0.768883 -0.748048
C  -0.979378 -0.70176 -1.635231
C  0.406487 -0.815852 -1.137658
C  2.944306 -1.065409 -0.223946
C  1.557663 -0.924477 -0.707465
C  3.292674 1.357886 0.095234
C  4.677851 -0.271831 1.300383
H  -2.29648 0.515153 2.166641
H  -3.671729 -0.623182 2.195099
H  -1.155906 -1.309663 1.120041
H  -2.67122 -2.016289 0.469649
H  -3.80018 1.873679 0.83937
H  -4.694816 0.456571 0.23973
H  -1.059447 0.07664 -2.41959
H  -1.282428 -1.665998 -2.095613
H  3.623542 -1.122848 -1.117587
H  3.047535 -2.029798 0.311525
H  2.271212 1.547564 -0.274425
H  4.003269 1.481704 -0.761901
H  3.533502 2.120495 0.856571
H  4.653102 -1.244922 1.823685
H  4.925302 0.507515 2.042206
H  5.506275 -0.303366 0.545993
