program: Gaussian 09
title: 000202209
version: EM64L-G09RevD.01
frameworkgroup: C1[X(C20H24N2O2S2)]
method: RPBEPBE
basis: SDD
operation: Freq
keyword: #p
keyword: freq=noraman
keyword: PBEPBE/SDD
title: #p freq=noraman PBEPBE/SDD
converged: YES YES NO NO
title: Mulliken charges:
elementType: S S O O N N C C C C C C C C C C C C C C C C C C C C H H H H H H H H H H H H H H H H H H H H H H H H
charge: 0.086418 0.026837 -0.285828 -0.282602 -0.377315 -0.362641 -0.349817 -0.321780 -0.344179 -0.398026 0.348400 0.321688 0.214971 0.136373 -0.354935 -0.389448 -0.680853 -0.672577 -0.340317 -0.351542 -0.158587 -0.159715 -0.251023 -0.226115 -0.240617 -0.238392 0.211847 0.246650 0.228310 0.239602 0.192293 0.243930 0.202732 0.230175 0.306913 0.325810 0.219277 0.206883 0.225566 0.218659 0.214067 0.210949 0.210008 0.273169 0.263567 0.238849 0.235729 0.234784 0.238470 0.233386
chargesum: 0.00000
title: Mulliken charges with hydrogens summed into heavy atoms:
elementType: S S O O N N C C C C C C C C C C C C C C C C C C C C
charge: 0.086418 0.026837 -0.285828 -0.282602 -0.070403 -0.036831 0.108679 0.146132 0.092044 0.034881 0.348400 0.321688 0.214971 0.136373 -0.354935 -0.389448 -0.029128 -0.028902 -0.130308 -0.078373 0.104979 0.079134 -0.015294 0.008669 -0.002147 -0.005006
polarizability: 3.66593613e+02 -7.28149423e-02 3.17345800e+02 -1.23571025e+01 2.06629994e+01 2.14412184e+02
1716.lowfreq: -9.7510 -5.6384 -5.1408 0.0010 0.0013 0.0014 12.3064 20.2111 25.3674
frequency: 11.3781 19.9473 25.2474 32.3440 35.0913 48.8959 55.2281 58.2131 70.1665 82.0335 87.9142 103.9192 114.1846 128.1398 137.1161 157.4571 178.2541 195.1481 212.3326 220.1359 227.5161 241.6784 248.2725 280.2377 284.4118 296.6190 307.2369 324.5446 331.9703 378.6302 401.2008 408.7389 417.5981 429.7670 444.8887 469.0990 484.1970 488.4545 528.8248 547.4093 548.3286 633.9632 645.9343 672.0324 677.3526 682.7049 684.4993 708.1077 740.4806 741.6630 751.5916 771.2294 779.2623 783.9494 802.0656 826.5960 862.1001 873.3339 880.0643 884.5738 900.2176 912.3456 953.8923 960.5727 970.1303 994.2159 996.1836 1001.1230 1013.5437 1024.1429 1041.2703 1044.5459 1056.9087 1088.0477 1094.5578 1109.4124 1111.5663 1125.7078 1143.1983 1150.6758 1159.6192 1161.1046 1172.0186 1179.1277 1234.1279 1243.1796 1246.4202 1260.8030 1269.6647 1292.4775 1297.6895 1302.1076 1316.4266 1341.6533 1353.1325 1359.1950 1364.7651 1376.3761 1388.6377 1393.6534 1410.0845 1415.6159 1443.8971 1444.7245 1452.1096 1468.9592 1472.0762 1475.1017 1478.5494 1483.2684 1486.1786 1486.7786 1508.1981 1510.8034 1527.1065 1558.3604 1571.1163 1583.6086 1592.7314 1597.7316 2965.6156 2974.6956 2977.5379 2981.5470 2986.4621 3005.4279 3030.0821 3040.8940 3056.4699 3068.6596 3070.3936 3076.5442 3082.4105 3085.9166 3120.6692 3132.3281 3132.7022 3146.3726 3147.7567 3159.1171 3167.8037 3170.2985 3437.5114 3564.6589
redmass: 4.8615 5.7761 4.2646 3.6842 3.6987 5.4581 3.6246 3.9444 3.7349 2.1952 3.4263 4.0306 3.3974 4.4676 3.0227 3.3485 5.1474 3.1907 4.2342 1.2198 2.6107 4.0632 4.8153 3.3503 4.4984 3.1263 3.2239 5.9898 4.3194 13.1903 6.2551 6.1291 6.7930 3.7781 2.5002 6.3916 3.8431 3.9974 1.5521 3.5774 2.6572 6.5457 5.9705 1.5967 4.9105 5.0075 3.0152 3.4577 1.7842 1.2640 2.2795 1.4064 1.5370 2.1757 2.3144 4.5119 2.3011 1.4119 1.7825 1.4233 1.4927 1.4348 1.3848 1.4329 2.0945 1.3648 1.3606 4.5368 7.1462 6.6785 2.4763 2.5593 2.5234 2.6154 1.9473 2.1898 1.8588 1.8679 1.8985 1.7605 2.3384 2.4937 1.0610 1.0868 1.2109 1.3294 1.4529 1.4273 1.4047 1.6397 1.2929 1.3640 1.5690 1.4856 1.4632 6.2754 1.3951 7.4875 1.2278 1.2093 2.0386 2.0712 2.1866 2.3201 1.2070 1.0958 1.0546 1.0549 1.0482 1.0882 1.0720 1.0832 1.7894 2.1148 5.0292 6.1124 6.5199 6.7690 6.4989 5.9283 1.0653 1.0360 1.0360 1.0631 1.0620 1.0631 1.0996 1.0970 1.0958 1.0992 1.1003 1.1003 1.0994 1.1037 1.0876 1.0868 1.0867 1.0900 1.0932 1.0945 1.1003 1.1007 1.0798 1.0773
irintensity: 0.4871 0.5684 0.3177 0.0225 0.7767 2.2538 0.6856 1.3560 9.2871 0.7088 5.7850 3.4028 1.3242 4.2701 5.0674 5.2162 2.3160 3.7401 1.2592 0.3148 3.4837 0.4409 8.0769 1.8101 2.3055 10.3655 9.2752 71.8807 7.1558 1.3896 2.7643 3.1803 0.9831 8.2641 0.5603 3.4722 2.6236 16.4563 54.2773 10.7896 52.3932 1.8422 4.0476 79.2517 23.5774 7.6816 2.2466 11.4993 60.0594 12.3260 25.8206 26.4473 20.4777 27.3706 2.6351 3.8053 1.0838 0.5193 12.8776 1.1546 2.0833 1.6979 1.3697 1.7012 1.9909 0.7739 1.5284 4.7687 3.7385 29.9271 8.6445 2.5132 2.5966 3.8644 6.2285 10.1852 4.9153 3.9668 7.9989 13.5185 4.2825 9.4034 1.2647 1.0970 3.8943 2.2808 28.3793 10.8265 12.8927 49.3761 42.3843 20.3174 78.1565 0.4231 3.6291 4.3204 2.1211 9.3164 11.7152 12.4250 4.5977 10.9438 17.8839 26.5436 38.7747 10.7709 16.2275 1.1173 26.4485 40.9617 12.6570 13.2177 102.3215 119.4990 462.4133 15.2361 96.9111 132.3096 83.4829 35.7801 24.1165 40.6463 35.6021 29.1519 18.4367 62.5550 22.2143 4.5790 10.6139 60.2681 12.6212 78.5924 32.1393 50.0145 11.0992 1.8597 3.1091 10.3888 6.0544 9.8582 28.5450 27.4134 193.6130 22.5039
temp: 298.150 k
press: 1.00000 atm
elementType: 16 16 8 8 7 7 6 6 6 6 6 6 6 6 6 6 6 6 6 6 6 6 6 6 6 6 1 1 1 1 1 1 1 1 1 1 1 1 1 1 1 1 1 1 1 1 1 1 1 1
symmnumber: 1
zpe: 1049230.2 jmol-1
zpe.correction: 0.399631 hartree
zpe.thermalcorrener: 0.427263 hartree
zpe.thermalcorrenthalpy: 0.428207 hartree
zpe.thermalcorrgfe: 0.337306 hartree
zpe.sumelectzpe: -1830.719409 hartree
zpe.sumelectthermal: -1830.691777 hartree
zpe.sumelectthermalent: -1830.690833 hartree
zpe.sumelectthermalfe: -1830.781733 hartree
dipole: 7.3138 4.6214 4.7782
dipole: 9.8833
quadrupole: -162.4799 -155.6810 -168.6937
quadrupole: -12.7947 1.0070 6.3693
quadrupole: -0.1950 6.6038 -6.4088 -12.7947 1.0070 6.3693
hfenergy: -1831.1190394 hartree
pointgroup: C01 [X(C20H24N2O2S2)]
dipole: -3.1102939 2.2082299 -0.7545944 debye
polarizability: 327.8000564|-6.2496375|234.4241151|14.9528882|-56.1990282|336.1274266 unknown
InChI: InChI=1S/C20H24N2O2S2/c1-3-13-21-19(23)15-9-5-7-11-17(15)25-26-18-12-8-6-10-16(18)20(24)22-14-4-2/h5-12,21-22H,3-4,13-14H2,1-2H3
charge 0 multiplicity 1
50 atoms
S  -0.128564 -1.683846 -0.652871
S  0.502636 -2.94534 1.263446
O  -0.534375 -0.023023 -2.468991
O  4.391254 -0.975965 2.108315
N  -2.082416 1.691932 -2.645317
N  2.866091 -0.712072 0.366676
C  -1.288814 2.414398 -3.659218
C  3.873709 -0.659723 -0.706407
C  -0.270269 3.403033 -3.041306
C  3.452463 0.315021 -1.828428
C  -2.477758 -0.163577 -1.055836
C  2.03124 -0.921527 2.672867
C  -1.650857 0.505793 -2.099442
C  3.189714 -0.906679 1.68867
C  -1.872496 -1.209361 -0.290283
C  0.819734 -1.670263 2.559271
C  0.558942 4.115515 -4.130451
C  3.392675 1.787408 -1.367785
C  -3.838184 0.171115 -0.815252
C  2.233077 -0.1359 3.838959
C  -2.632235 -1.87791 0.6983
C  -0.161582 -1.577725 3.583994
C  -4.587814 -0.496571 0.170153
C  1.254493 -0.046799 4.849117
C  -3.975915 -1.523276 0.928936
C  0.045059 -0.767437 4.718883
H  -1.986248 2.950737 -4.330238
H  -0.750225 1.65761 -4.255565
H  4.024907 -1.675443 -1.126885
H  4.82931 -0.353387 -0.244244
H  -0.806195 4.15059 -2.423241
H  0.398363 2.840123 -2.363821
H  4.180756 0.210686 -2.656204
H  2.467291 0.009091 -2.235776
H  -2.90285 2.153258 -2.251732
H  1.877942 -0.668863 0.091256
H  1.128141 3.385816 -4.736045
H  -0.087794 4.693919 -4.81725
H  1.283361 4.817149 -3.680298
H  2.675386 1.914825 -0.536292
H  4.381497 2.131655 -1.011355
H  3.078592 2.45013 -2.195939
H  -4.332729 0.934193 -1.428444
H  3.189829 0.38722 3.935817
H  -2.161799 -2.6833 1.272336
H  -1.078974 -2.166954 3.489704
H  -5.637472 -0.234369 0.336176
H  1.436599 0.573781 5.73316
H  -4.550506 -2.05991 1.691722
H  -0.723291 -0.71298 5.497664
