program: Gaussian 09
title: 000193861
version: EM64L-G09RevD.01
frameworkgroup: C1[X(C5H11N3O4)]
method: RPBEPBE
basis: SDD
operation: Freq
keyword: #p
keyword: freq=noraman
keyword: PBEPBE/SDD
title: #p freq=noraman PBEPBE/SDD
converged: YES YES NO NO
title: Mulliken charges:
elementType: O O O O N N N C C C C C H H H H H H H H H H H
charge: -0.223808 -0.424833 -0.227173 -0.313073 -0.615966 -0.303829 -0.640353 -0.445311 -0.160361 -0.293185 0.147198 0.323528 0.249618 0.265687 0.237455 0.214219 0.267824 0.333127 0.281755 0.297419 0.376930 0.345734 0.307397
chargesum: 0.00000
title: Mulliken charges with hydrogens summed into heavy atoms:
elementType: O O O O N N N C C C C C
charge: -0.223808 -0.047903 -0.227173 -0.313073 -0.001084 -0.006410 0.012778 0.069994 0.077094 0.188859 0.147198 0.323528
polarizability: 1.19056340e+02 -3.58868068e+00 9.25458125e+01 6.53033015e+00 1.36409616e+00 6.12736268e+01
1716.lowfreq: -10.8928 -3.3092 -0.0004 0.0002 0.0005 9.5420 33.6214 37.8637 50.6217
frequency: 33.3338 37.7775 50.5969 88.3151 92.9902 114.9349 153.2742 217.9281 257.1364 264.2250 284.3511 360.5035 369.1168 378.7079 406.8582 456.6525 470.6261 484.6558 499.4521 565.4853 608.5946 642.0268 682.1617 701.3223 722.8727 764.4803 822.2038 882.9979 918.5207 974.2931 998.0618 1023.4780 1035.2595 1066.4856 1075.1494 1151.5100 1176.6509 1230.0533 1248.4946 1290.4217 1303.6869 1312.5050 1324.2790 1336.4637 1355.7717 1436.4339 1453.7008 1468.9292 1597.0730 1643.9580 1659.0557 1665.1719 2949.5023 3005.7508 3021.4975 3085.9860 3105.4007 3417.1309 3505.4314 3512.9967 3543.1329 3570.6084 3696.6096
redmass: 6.2269 9.0861 4.8946 3.1300 3.6505 5.1905 4.3234 1.9520 2.7191 2.2261 4.2001 1.3023 3.3438 3.4001 3.2534 1.3947 1.2544 2.4173 3.4279 2.0656 1.8702 4.4693 3.0858 5.2004 1.7238 1.6579 4.4419 3.5879 3.3320 2.4468 1.6924 2.8105 2.8693 3.1931 3.3141 1.4810 1.8252 1.2348 1.4808 1.4929 1.3714 1.6088 1.4443 1.3527 1.3341 2.0083 1.0863 1.0894 1.3985 2.1786 8.4203 1.3160 1.0825 1.0594 1.0606 1.1038 1.1059 1.0506 1.0641 1.0780 1.0460 1.0941 1.1044
irintensity: 5.3574 1.2081 7.2487 1.6637 9.8352 15.9270 5.6832 16.6055 7.4571 8.9993 15.3156 59.6762 1.9122 25.4816 21.0336 402.7588 14.8306 68.6790 10.6347 65.2113 69.6145 36.7924 71.3682 27.0770 227.2676 27.4434 28.1571 14.0386 22.1838 8.4636 10.1561 250.0687 22.7634 8.2309 14.2640 6.0432 3.5293 17.9940 2.6287 24.7202 16.3449 110.9462 0.5388 0.4358 5.2552 216.2476 0.9132 31.7120 80.8746 305.7788 238.9318 68.8992 36.9361 45.2372 7.6688 0.2522 21.5970 79.5416 11.7153 14.4393 44.2947 27.8903 39.0816
temp: 298.150 k
press: 1.00000 atm
elementType: 8 8 8 8 7 7 7 6 6 6 6 6 1 1 1 1 1 1 1 1 1 1 1
symmnumber: 1
zpe: 469971.1 jmol-1
zpe.correction: 0.179003 hartree
zpe.thermalcorrener: 0.192892 hartree
zpe.thermalcorrenthalpy: 0.193836 hartree
zpe.thermalcorrgfe: 0.137115 hartree
zpe.sumelectzpe: -661.279938 hartree
zpe.sumelectthermal: -661.266049 hartree
zpe.sumelectthermalent: -661.265105 hartree
zpe.sumelectthermalfe: -661.321826 hartree
dipole: 4.0541 1.5679 1.2426
dipole: 4.5209
quadrupole: -40.0269 -72.6202 -73.2121
quadrupole: -7.3410 3.5523 -0.4023
quadrupole: 21.9261 -10.6671 -11.2590 -7.3410 3.5523 -0.4023
hfenergy: -661.4589403 hartree
pointgroup: C01 [X(C5H11N3O4)]
dipole: -1.45189 0.7352202 0.7176601 debye
dipolederiv: -0.5745783 0.0541656 -0.0320135 -0.0106379 -0.1325513 0.0552858 0.0442983 -0.0577542 -0.296232 -0.7039227 0.2423175 -0.3924903 0.2498792 -0.619629 0.3616701 -0.3494182 0.3122881 -0.6985028 -0.5457617 0.1540598 0.2004911 0.2395165 -0.4391659 -0.1285255 0.0908505 0.0389317 -0.9828021 -1.0769893 0.2400585 0.181863 0.1786283 -0.4787971 -0.14207 0.1831631 -0.1521551 -0.7503917 -0.5750121 0.2124999 0.0023376 0.2340735 -0.6868829 0.0155238 -0.033043 0.0143428 -0.4827018 -0.084691 -0.1379736 0.0246471 -0.2568412 -0.3652595 -0.3841368 -0.1404296 -0.1087703 -0.736299 -1.1743797 0.028802 -0.4152286 0.1145232 -0.7604088 0.1703434 -0.5004773 0.1513306 -0.5324723 0.0113115 -0.0039821 0.0311682 0.1100359 -0.0623835 -0.1193765 0.0328483 -0.0107915 0.0241017 0.2211078 -0.0588584 0.1955564 -0.0363207 0.3402153 -0.0543483 0.3682217 -0.216626 0.2594074 0.6927695 -0.0421841 0.1200492 0.034678 0.1455173 0.1919021 0.0477436 0.0459166 0.2945396 0.8281793 -0.5136948 0.0187339 -0.6498147 0.5647607 -0.0693942 0.0747782 -0.1807408 1.3733662 1.661718 -0.430684 0.1491726 -0.4414518 0.5247002 0.2009394 0.4046484 0.1565643 1.6258562 0.0228558 0.059022 -0.0499517 0.0531473 0.0164782 0.0734766 -0.055137 0.0961524 -0.0067543 0.0842626 -0.0703861 0.0020077 -0.0567725 0.0581868 -0.0560003 -0.0204857 -0.0696503 0.0131152 -0.0430414 -0.0164859 -0.0856705 -0.0560849 -0.0166187 -0.0641034 -0.1243925 -0.0509918 -0.0263079 -0.0421933 -0.0078444 -0.055107 -0.009932 0.0738263 -0.0485942 -0.0408523 -0.0780253 -0.1648286 0.0551004 0.0269233 -0.0333193 0.0056028 -0.0236139 0.0129999 -0.0620561 0.0707972 0.1144437 0.4768235 -0.053632 -0.0730913 -0.05718 0.1723838 -0.0077611 -0.1160622 0.0275145 0.1857912 0.0914496 -0.0719681 0.0667937 -0.0359279 0.3504887 0.0107988 0.0448983 0.1344369 0.0980458 0.025465 0.0989147 0.0263813 0.0962234 0.3229392 0.0701909 -0.0581294 0.024252 0.1280943 0.2486646 0.1265975 0.0723756 0.108495 0.2834632 -0.0531436 0.1315363 -0.0921924 0.2066908 0.2110704 0.0758847 0.0172371 0.0825025 0.3695626 -0.0056818 0.0435699 -0.0219116 0.207349 0.1897914 0.0884479 0.0280577 0.1036581 0.3627886 -0.029995 0.0339268 -0.0329176 0.1464915 unknown
polarizability: 114.2580381|-17.6451916|66.2673022|1.7044093|-1.5799103|92.3504386 unknown
InChI: InChI=1S/C5H11N3O4/c6-3(4(9)10)1-2-12-8-5(7)11/h3,8-9H,1-2,6-7H2
charge 0 multiplicity 1
23 atoms
O  -1.514571 -0.076552 1.663131
O  3.612209 -1.255292 0.521722
O  3.194628 -0.715574 -1.698286
O  -1.601185 -0.023575 -1.166416
N  1.205904 1.231628 -0.896454
N  -2.484002 0.669264 0.901878
N  -3.75412 0.872254 -1.062021
C  0.841603 -0.369649 0.949546
C  1.888416 0.418956 0.107034
C  -0.156511 0.581111 1.635126
C  2.924646 -0.557359 -0.489019
C  -2.558961 0.449115 -0.484081
H  1.36373 -1.009992 1.678769
H  0.260726 -1.016412 0.267067
H  2.470491 1.074052 0.791409
H  0.096567 0.773114 2.693745
H  -0.237227 1.528841 1.078149
H  0.3829 0.768865 -1.306606
H  1.823722 1.647831 -1.598644
H  -3.3141 0.862908 1.468605
H  4.290354 -1.852693 0.103685
H  -3.806566 0.838936 -2.077095
H  -4.549152 1.228719 -0.536344
