program: Gaussian 09
title: 000192226
version: EM64L-G09RevD.01
frameworkgroup: C1[X(C13H16O4)]
method: RPBEPBE
basis: SDD
operation: Freq
keyword: #pfreq=noraman
keyword: PBEPBE/SDD
title: #p freq=noraman PBEPBE/SDD
converged: YES YES NO NO
title: Mulliken charges:
elementType: O O O O C C C C C C C C C C C C C H H H H H H H H H H H H H H H H
charge: -0.281625 -0.277591 -0.208484 -0.207091 -0.542625 0.553608 -0.358173 -0.497836 -0.426989 0.250603 -0.684838 0.221604 -0.294932 0.246261 0.244518 -0.746794 -0.746544 0.202861 0.204319 0.221413 0.209792 0.267092 0.238544 0.209415 0.211271 0.222561 0.261636 0.252275 0.246521 0.255445 0.252126 0.246677 0.254982
chargesum: 0.00000
title: Mulliken charges with hydrogens summed into heavy atoms:
elementType: O O O O C C C C C C C C C C C C C
charge: -0.281625 -0.277591 -0.208484 -0.207091 -0.135445 0.553608 0.073032 -0.230744 -0.188446 0.250603 -0.041591 0.221604 -0.033296 0.246261 0.244518 0.007447 0.007242
polarizability: 2.09548479e+02 -2.36396465e+00 1.68547021e+02 -3.79804086e+00 1.90428689e-01 9.82220440e+01
1716.lowfreq: -6.5720 -4.3676 -0.0012 -0.0008 -0.0006 5.4536 16.2671 30.3589 32.2650
frequency: 16.2288 29.8595 32.2533 41.1672 52.2687 58.6265 72.8169 78.9292 82.9769 97.8026 124.6303 201.0069 223.2545 249.0959 260.7560 273.1000 278.0690 330.3505 360.5821 377.4782 454.6738 462.1168 507.3575 529.0566 550.2027 557.3546 611.0383 627.0714 662.0774 699.7083 718.3417 747.4662 763.3430 820.8088 836.4597 860.2935 871.1943 880.8165 901.1100 950.4004 951.0807 988.3228 993.7946 1039.7801 1040.1250 1051.7613 1073.3912 1090.9546 1095.2592 1153.9775 1164.0868 1177.8619 1198.7112 1221.6944 1245.2567 1269.2380 1285.1912 1288.8113 1340.4113 1381.2083 1382.4287 1384.3541 1388.9677 1409.7982 1451.8582 1452.2269 1452.7591 1452.9749 1471.8469 1475.7259 1477.9869 1490.4375 1492.0091 1592.7221 1612.3238 1675.3062 1676.6373 2972.5467 2976.6826 2986.4972 3009.4379 3009.5986 3020.5006 3045.0333 3071.6259 3074.9130 3097.9440 3098.0112 3135.9969 3145.0077 3145.2813 3165.7965 3183.4203
redmass: 5.9071 3.0943 5.5293 1.9711 1.9355 1.6664 2.0979 1.6381 2.5179 3.0830 5.0537 5.3644 1.1455 5.9931 3.5601 3.1007 5.0861 3.3137 3.3863 4.8009 3.2299 4.3279 4.3433 4.6758 3.1246 3.3864 5.2831 4.8926 6.3020 4.9860 3.8711 1.1114 4.0017 1.8474 3.5156 2.9974 1.3636 2.4134 1.6585 3.1508 1.4179 2.0550 1.9982 1.6466 1.6457 2.9309 1.5858 2.9583 2.2999 1.4552 2.7182 3.5681 1.9382 1.3956 3.0196 1.3420 1.3274 1.3801 1.4616 2.2225 1.3407 1.8255 1.2122 3.2032 1.0496 1.0534 1.0549 1.0526 1.0818 1.0514 1.0541 1.1256 2.7113 7.6725 7.1100 10.1828 10.1459 1.0371 1.0580 1.0602 1.0367 1.0366 1.1001 1.1033 1.1017 1.0991 1.0973 1.0971 1.0902 1.1014 1.1013 1.0924 1.0950
irintensity: 2.6928 0.2799 1.4817 1.5566 2.2120 0.1860 0.4220 0.4506 1.3338 3.0503 5.1915 1.9267 0.1004 0.5300 3.9200 2.8491 0.2806 0.4229 1.7380 0.3640 5.3049 6.8231 6.7615 11.7771 0.3717 3.3413 8.7157 16.1696 2.6154 1.2667 9.3124 3.5301 3.9745 51.2451 31.4981 46.9537 10.8737 26.4338 4.4748 17.5323 0.9694 126.7669 110.5946 11.3572 7.0469 1.4577 29.9790 161.3753 103.7971 66.4935 431.2687 364.1511 18.2486 0.1373 53.2169 1.7183 2.6327 2.9997 1.4608 36.7876 16.4092 69.8696 10.0775 27.9260 33.4293 21.9783 18.8329 16.5191 0.0913 8.8129 5.1938 24.0878 93.5200 18.7617 7.8933 309.3836 41.5599 33.9686 16.7351 59.8797 1.6379 1.1077 0.7045 8.2015 76.0306 44.9331 4.7458 7.1845 13.8054 12.8266 8.7722 2.2459 2.5045
temp: 298.150 k
press: 1.00000 atm
elementType: 8 8 8 8 6 6 6 6 6 6 6 6 6 6 6 6 6 1 1 1 1 1 1 1 1 1 1 1 1 1 1 1 1
symmnumber: 1
zpe: 686547.1 jmol-1
zpe.correction: 0.261492 hartree
zpe.thermalcorrener: 0.280359 hartree
zpe.thermalcorrenthalpy: 0.281304 hartree
zpe.thermalcorrgfe: 0.210131 hartree
zpe.sumelectzpe: -804.612379 hartree
zpe.sumelectthermal: -804.593512 hartree
zpe.sumelectthermalent: -804.592568 hartree
zpe.sumelectthermalfe: -804.663740 hartree
dipole: -0.8944 0.9561 0.2297
dipole: 1.3292
quadrupole: -83.2118 -98.4934 -103.6405
quadrupole: -11.4501 -6.9420 -10.1842
quadrupole: 11.9034 -3.3781 -8.5253 -11.4501 -6.9420 -10.1842
hfenergy: -804.8738712 hartree
pointgroup: C01 [X(C13H16O4)]
dipole: 0.3843002 -0.3477451 0.0697919 debye
polarizability: 209.639572|1.1178289|168.1877065|3.883908|4.3288016|98.490266 unknown
InChI: InChI=1S/C13H16O4/c1-4-5-11-6-7-12(16-9(2)14)13(8-11)17-10(3)15/h6-8H,4-5H2,1-3H3
charge 0 multiplicity 1
33 atoms
O  1.195658 -1.480091 -0.584682
O  2.194336 0.789475 0.523325
O  -0.092819 -3.145477 0.471336
O  2.701248 2.801653 -0.591377
C  -3.448881 0.458784 -0.689811
C  -1.956629 0.586306 -0.429665
C  -4.230832 -0.03297 0.561875
C  -1.099085 -0.525557 -0.61535
C  -1.397898 1.800199 0.045332
C  0.27524 -0.423284 -0.324721
C  -5.744526 -0.166144 0.293794
C  0.81645 0.790647 0.160529
C  -0.023044 1.908226 0.340515
C  0.929782 -2.808599 -0.152156
C  3.063068 1.834321 0.102033
C  2.08165 -3.693057 -0.569287
C  4.451077 1.551398 0.628034
H  -3.863596 1.436226 -1.005443
H  -3.633036 -0.250684 -1.520272
H  -3.816204 -1.007354 0.886099
H  -4.055628 0.672997 1.397423
H  -1.501246 -1.474272 -0.981787
H  -2.045238 2.673745 0.183149
H  -6.184771 0.804621 -0.003245
H  -5.942682 -0.887972 -0.521024
H  -6.280065 -0.51862 1.194019
H  0.399512 2.850488 0.69705
H  2.237136 -3.626113 -1.659649
H  1.874771 -4.733464 -0.281182
H  3.01168 -3.34871 -0.08463
H  4.422827 1.409285 1.721707
H  5.122266 2.383388 0.371898
H  4.833585 0.614809 0.18606
