program: Gaussian 09
title: 000191637
version: EM64L-G09RevD.01
frameworkgroup: C1[X(C15H20N2O2)]
method: RPBEPBE
basis: SDD
operation: Freq
keyword: #p
keyword: freq=noraman
keyword: PBEPBE/SDD
title: #p freq=noraman PBEPBE/SDD
converged: YES YES NO NO
title: Mulliken charges:
elementType: O O N N C C C C C C C C C C C C C C C H H H H H H H H H H H H H H H H H H H H
charge: -0.404838 -0.261065 -0.228597 -0.588913 0.267773 0.287141 0.364209 0.094024 -0.427396 -0.743674 -0.697392 -0.696067 -0.594180 -0.308022 -0.197342 -0.420070 -0.279716 -0.254979 0.226233 0.291424 0.227438 0.229146 0.232305 0.228254 0.209663 0.236810 0.209615 0.227582 0.236705 0.217866 0.227339 0.218376 0.263156 0.227504 0.217379 0.219115 0.287398 0.285566 0.370228
chargesum: 0.00000
title: Mulliken charges with hydrogens summed into heavy atoms:
elementType: O O N N C C C C C C C C C C C C C C C
charge: -0.034610 -0.261065 -0.228597 -0.015950 0.267773 0.287141 0.364209 0.094024 -0.135972 -0.054784 -0.022664 -0.022165 -0.148975 -0.089646 0.065814 -0.192566 -0.062338 -0.035864 0.226233
polarizability: 2.00801945e+02 3.69291245e+00 2.13729297e+02 -1.93693086e+01 1.08200037e+01 1.28861603e+02
1716.lowfreq: -24.4329 -11.8854 -8.8514 -0.0007 -0.0006 0.0001 2.5734 16.6251 40.0072
frequency: -22.9681 15.0882 39.9220 47.8220 73.8493 86.3373 138.5414 156.4881 157.1401 168.4392 206.3063 215.7392 227.6332 237.1164 260.7596 274.2765 294.3551 313.3558 323.3063 349.9958 379.0515 397.0457 417.4910 431.8424 450.5999 482.8632 530.7562 537.9669 572.7064 585.1670 591.8024 602.4663 610.1685 647.6000 717.7387 744.4473 751.7649 756.9749 764.1857 777.8653 809.2122 817.0043 847.5954 910.2523 921.1195 926.6613 940.0507 950.7570 966.3180 973.1078 1005.5103 1019.4788 1027.0326 1031.2781 1066.6376 1071.7304 1094.9625 1119.5958 1137.5891 1167.4320 1179.8901 1189.7028 1217.3734 1226.7717 1229.2768 1248.4321 1257.4282 1295.4732 1311.2320 1320.3373 1339.3181 1376.3741 1379.9539 1382.7635 1393.8058 1403.3786 1413.2172 1454.5503 1454.9095 1457.7451 1467.2505 1470.8738 1473.4137 1478.2929 1485.9875 1499.7344 1557.3224 1578.4506 1614.7265 1620.0778 1661.2640 2985.0425 2987.6425 2990.9275 2995.8153 3041.7774 3069.3001 3083.2402 3085.9339 3088.7575 3094.7365 3103.3090 3107.7078 3117.0738 3130.2229 3150.3019 3166.3076 3244.8080 3492.8139 3509.0890 3651.5298
redmass: 5.0683 5.5586 5.7082 3.4558 3.3907 3.4868 3.4386 1.3122 1.2488 2.5319 3.3365 1.1550 3.5648 2.9698 3.2416 2.6236 2.9803 1.4787 1.7050 2.8473 3.1242 2.5492 1.7857 2.8711 3.0178 2.8287 3.3072 3.4265 4.1266 3.6784 4.0172 2.3283 1.9740 3.0567 4.6402 1.3350 4.2163 4.0748 4.1282 3.2092 2.7220 1.5379 1.4728 1.7033 1.6545 1.3754 1.7062 1.2037 1.2929 4.3800 5.0349 2.1047 1.5059 1.3904 2.1918 2.1528 2.7174 1.8517 1.6306 1.2068 1.5599 1.3909 2.3400 2.2849 3.0287 1.9546 1.7377 1.4165 2.2852 1.4804 2.3319 2.8679 1.2025 1.2152 1.7715 1.9351 1.7889 1.0576 1.4283 2.0832 1.0513 1.1364 1.5320 1.5419 1.0537 1.0641 6.2015 6.8104 1.2674 7.0761 4.1259 1.0596 1.0357 1.0360 1.0369 1.0999 1.0893 1.1006 1.0999 1.1004 1.0989 1.0988 1.0981 1.0860 1.0892 1.0948 1.0977 1.0970 1.0636 1.0444 1.1009
irintensity: 9.5162 0.8174 4.0529 2.0640 2.2255 0.5612 0.6416 44.7709 7.6993 4.8317 4.9781 0.4170 1.0740 23.3173 1.2225 7.5837 2.0041 1.2346 0.7817 4.6466 1.9199 5.2066 114.9434 2.7833 33.5588 137.1608 3.8030 1.8135 22.7522 8.1090 1.5778 88.5594 55.5557 27.6006 51.4276 103.3298 5.6945 3.5125 2.6959 8.7628 0.5494 8.0476 1.4237 0.7530 3.4682 1.9919 3.2182 0.0643 0.0912 2.5579 106.5599 11.8839 5.9341 0.1037 138.0507 22.9466 40.8315 3.1802 11.1739 1.8383 8.5071 4.8660 38.8889 115.5834 19.3936 15.6999 14.0317 6.5888 37.6936 6.4110 32.8695 11.9441 29.0521 23.3706 14.5182 48.9795 4.2813 1.0674 17.1272 29.8555 0.4337 1.3186 7.0648 10.6232 8.8738 15.7838 5.1883 1.0852 87.3985 4.2922 125.5465 41.0911 14.9974 26.0915 24.3224 6.3689 14.2929 1.4682 3.7649 33.7204 80.2730 7.7983 43.3266 5.3452 11.4689 42.1654 25.6513 0.6906 12.3027 8.5674 10.5449
temp: 298.150 k
press: 1.00000 atm
elementType: 8 8 7 7 6 6 6 6 6 6 6 6 6 6 6 6 6 6 6 1 1 1 1 1 1 1 1 1 1 1 1 1 1 1 1 1 1 1 1
symmnumber: 1
zpe: 847410.5 jmol-1
zpe.correction: 0.322762 hartree
zpe.thermalcorrener: 0.341622 hartree
zpe.thermalcorrenthalpy: 0.342566 hartree
zpe.thermalcorrgfe: 0.275329 hartree
zpe.sumelectzpe: -842.136385 hartree
zpe.sumelectthermal: -842.117524 hartree
zpe.sumelectthermalent: -842.116580 hartree
zpe.sumelectthermalfe: -842.183818 hartree
dipole: -1.4038 -0.7254 -0.1026
dipole: 1.5835
quadrupole: -104.3625 -107.9328 -113.5361
quadrupole: 12.9461 -5.7712 -3.6506
quadrupole: 4.2479 0.6777 -4.9257 12.9461 -5.7712 -3.6506
hfenergy: -842.4591467 hartree
pointgroup: C01 [X(C15H20N2O2)]
dipole: -0.5062056 -0.356485 -0.0693266 debye
polarizability: 201.0230975|2.4324549|213.5809329|-18.7915092|11.9785623|128.7888146 unknown
InChI: InChI=1S/C15H20N2O2/c1-15(2,3)17-9-10(8-12(16)14(18)19)11-6-4-5-7-13(11)17/h4-7,9,12,18H,8,16H2,1-3H3
charge 0 multiplicity 1
39 atoms
O  3.013489 -0.677016 2.092395
O  3.304603 -1.765115 0.06479
N  -1.267198 -0.822681 -0.299613
N  4.444492 1.075225 -0.245202
C  -2.209462 -1.988544 -0.172007
C  -1.545798 0.525128 0.015872
C  0.654034 0.373551 -0.751533
C  -0.352773 1.292069 -0.258849
C  0.06259 -0.888049 -0.758368
C  -1.502071 -3.289972 -0.621778
C  -3.440687 -1.759075 -1.09148
C  -2.631327 -2.148664 1.314907
C  2.07689 0.702567 -1.127398
C  -2.714796 1.156938 0.510361
C  3.061789 0.703484 0.08728
C  -0.347537 2.694364 -0.035621
C  -2.681232 2.549232 0.725377
C  -1.510311 3.315826 0.454921
C  3.127268 -0.700098 0.701245
H  0.514871 -1.828808 -1.059014
H  -2.211567 -4.1291 -0.517493
H  -1.189987 -3.242379 -1.680209
H  -0.618451 -3.51548 0.001335
H  -3.119959 -1.681297 -2.145511
H  -4.141215 -2.608974 -1.001308
H  -3.986666 -0.836569 -0.836486
H  -3.322135 -3.004612 1.420012
H  -1.743737 -2.335963 1.944937
H  -3.136766 -1.250141 1.703553
H  2.137176 1.704612 -1.594496
H  2.462093 -0.028079 -1.864315
H  -3.632337 0.603729 0.728114
H  2.695532 1.393027 0.865973
H  0.551638 3.285633 -0.24643
H  -3.576923 3.051339 1.108333
H  -1.522487 4.397042 0.63226
H  4.68585 2.062065 -0.168539
H  4.858375 0.585337 -1.040122
H  3.124732 -1.602849 2.444407
