program: Gaussian 09
title: 000191263
version: EM64L-G09RevD.01
frameworkgroup: C1[X(C21H21N5O5S2)]
method: RPBEPBE
basis: SDD
operation: Freq
keyword: #p
keyword: freq=noraman
keyword: PBEPBE/SDD
title: #p freq=noraman PBEPBE/SDD
converged: YES YES NO NO
title: Mulliken charges:
elementType: S S O O O O O N N N N N C C C C C C C C C C C C C C C C C C C C C H H H H H H H H H H H H H H H H H H H H H
charge: 0.250045 0.220851 -0.168735 -0.413421 -0.259428 -0.190231 -0.264261 -0.186887 -0.371682 0.016577 -0.684197 -0.424274 -0.470694 -0.206276 0.103488 0.222549 0.409692 -0.795957 -0.869647 0.214136 0.089313 -0.705412 0.362959 0.340616 -0.400423 -0.250110 -0.544730 -0.423489 -0.241828 -0.241955 -0.121661 -0.244655 0.193883 0.326382 0.308923 0.285031 0.294036 0.412705 0.327972 0.320071 0.240252 0.231611 0.388305 0.234376 0.225251 0.273601 0.229710 0.231008 0.230553 0.255996 0.295696 0.323125 0.269130 0.352113
chargesum: 0.00000
title: Mulliken charges with hydrogens summed into heavy atoms:
elementType: S S O O O O O N N N N N C C C C C C C C C C C C C C C C C C C C C
charge: 0.250045 0.220851 -0.168735 -0.025116 -0.259428 -0.190231 -0.264261 -0.186887 0.041022 0.016577 -0.065377 -0.072161 -0.144312 0.102647 0.103488 0.222549 0.409692 -0.216890 -0.221604 0.214136 0.089313 -0.233549 0.362959 0.340616 -0.166047 -0.250110 -0.045879 -0.193778 -0.010820 -0.011402 0.134335 0.024475 0.193883
polarizability: 4.85574536e+02 4.59036131e+01 2.87669303e+02 3.61245407e+00 2.67044473e+01 2.41406186e+02
1716.lowfreq: -16.7867 -8.1645 -2.8537 0.0011 0.0016 0.0025 1.4463 6.0141 9.5007
frequency: -14.8509 5.4775 9.3727 19.7969 25.8770 30.3691 37.5651 41.8922 59.2769 65.5669 84.3876 89.1398 96.0531 104.5633 111.4980 137.5601 152.8714 167.8205 173.7419 199.8144 213.1299 229.0576 240.4093 262.4765 265.9991 276.4700 283.1004 284.9383 307.2715 339.7001 364.8995 369.7407 381.0584 392.3612 405.6956 421.0032 432.7460 435.7605 443.1670 449.0237 451.3477 495.3429 500.1986 504.5030 540.1973 553.3168 580.4176 584.3066 599.9024 614.5592 621.4948 626.6665 638.0872 666.2281 675.3469 685.5112 710.1680 710.8946 718.4054 722.6751 732.5024 745.2582 757.1916 776.9329 781.3582 794.0434 829.6581 842.9613 854.6885 866.1513 869.4129 881.3859 908.6734 924.1745 933.8580 950.5768 955.3625 958.7050 960.5075 977.3153 978.5949 991.1089 1002.7511 1027.0178 1053.0961 1065.0250 1071.0591 1085.8864 1092.5627 1101.7981 1110.6744 1135.9747 1145.1552 1155.6839 1172.1502 1177.8019 1185.2018 1188.0838 1193.5498 1202.9611 1221.9680 1224.5088 1232.4056 1240.0522 1252.0535 1257.4187 1257.7131 1267.5939 1286.5654 1293.7667 1299.0993 1322.5863 1330.8764 1371.1899 1372.0084 1389.1983 1395.6721 1401.8567 1422.1642 1435.2787 1455.5868 1461.1748 1480.9297 1485.6808 1496.6812 1562.3512 1580.5048 1585.1569 1602.4497 1609.6324 1632.6855 1651.7627 1657.4683 1657.6256 1712.4453 2794.6003 2965.0175 3008.6876 3014.3003 3017.0831 3027.4583 3031.8066 3054.5761 3082.5427 3087.3722 3115.7024 3126.7731 3141.8794 3142.2932 3149.7561 3163.6229 3187.5110 3404.7624 3493.7881 3522.2256 3526.4565
redmass: 4.6080 7.2911 9.2877 7.2839 5.3764 6.9793 7.4092 8.7634 9.4903 7.6920 8.3082 6.9746 8.7189 9.1636 4.7620 7.9868 5.8793 5.1244 3.9970 5.0184 3.9041 5.2799 4.5047 4.1148 6.1784 6.2369 7.0152 6.2900 3.9242 3.1035 3.0224 5.0865 7.9420 5.3963 4.1465 2.7051 4.4427 2.5590 5.2652 6.0157 2.0325 5.4115 2.6558 4.4748 5.4789 3.8719 2.9510 3.9294 4.2354 4.7437 4.6101 7.9284 2.9942 5.4212 3.6505 5.1045 3.5272 4.1151 4.0199 5.9266 5.6229 1.4663 1.3147 4.1337 7.6776 7.4120 1.6314 2.5773 1.4624 2.0730 2.5434 1.5006 3.1283 2.1604 4.1063 2.5996 2.8117 3.4532 1.9451 1.3028 2.3409 1.3471 4.3562 2.4600 1.8018 2.7417 1.9745 3.1020 2.5357 2.0110 2.2063 1.3814 1.2967 1.5051 1.2219 1.1112 1.7444 3.1615 1.8527 2.0514 1.4083 1.9669 1.4637 2.2590 1.2101 1.2388 1.3054 1.9837 1.5686 2.6096 2.2004 1.3286 1.5156 1.8357 4.8342 5.2779 1.8419 1.4305 1.1058 2.1814 1.1525 1.1096 1.8549 4.1421 1.2078 5.8575 3.3570 3.4187 7.8548 5.8120 1.1422 9.2613 4.6517 2.1770 11.6500 1.0988 1.0623 1.0619 1.0992 1.0605 1.0836 1.0645 1.0884 1.1008 1.1002 1.0874 1.0880 1.1006 1.0932 1.0907 1.1010 1.0977 1.0467 1.0638 1.0948 1.0791
irintensity: 1.7161 0.9670 0.1647 0.8144 0.9844 2.1308 0.1664 1.7008 1.4608 2.4759 3.1803 2.9290 2.1730 1.0728 6.1114 2.1846 5.7932 4.6685 2.6475 1.6422 12.0922 5.8995 15.4272 11.5103 4.5611 3.7195 5.4562 1.5549 8.8938 6.5091 0.7897 3.1747 1.4893 0.9062 4.4084 2.0469 35.6331 21.8992 30.5727 9.4186 20.5873 1.3786 20.7150 7.7501 8.4060 21.4075 97.3582 8.0146 7.2720 9.4177 13.7450 48.6351 44.3305 4.6506 74.8070 14.3850 11.3971 0.2772 7.9211 2.2440 28.9724 85.1072 70.1293 6.1037 5.2741 21.6474 35.8195 14.5384 52.7572 5.4008 40.2515 9.8944 28.1106 1.6359 15.0909 97.5305 37.4127 67.5385 5.4609 0.0570 21.5160 0.1416 55.9050 23.8946 62.3876 44.3561 205.7038 156.2334 192.9016 7.0131 104.5701 6.0845 0.9242 19.7145 17.7201 2.1273 50.3153 10.9808 5.4884 11.5638 17.3564 1.1813 6.2989 21.8670 35.5297 4.4485 19.4485 13.7318 26.2304 83.8992 263.7643 2.4933 7.8601 33.1583 2.5228 263.4904 5.8543 14.7199 11.4056 9.4872 17.7115 17.8504 37.5958 44.8452 8.1414 268.6116 202.4955 149.2646 96.3483 0.5906 15.2770 88.8680 408.9292 151.6929 663.1551 805.1974 28.4446 12.6411 11.1172 16.0848 31.6042 9.7867 17.8831 9.3586 2.9558 10.3366 2.6258 19.8011 26.8861 2.2610 33.7538 1.5714 0.2241 39.4086 5.7971 46.0943
temp: 298.150 k
press: 1.00000 atm
elementType: 16 16 8 8 8 8 8 7 7 7 7 7 6 6 6 6 6 6 6 6 6 6 6 6 6 6 6 6 6 6 6 6 6 1 1 1 1 1 1 1 1 1 1 1 1 1 1 1 1 1 1 1 1 1
symmnumber: 1
zpe: 1052782.0 jmol-1
zpe.correction: 0.400983 hartree
zpe.thermalcorrener: 0.431328 hartree
zpe.thermalcorrenthalpy: 0.432272 hartree
zpe.thermalcorrgfe: 0.333697 hartree
zpe.sumelectzpe: -2256.413132 hartree
zpe.sumelectthermal: -2256.382787 hartree
zpe.sumelectthermalent: -2256.381843 hartree
zpe.sumelectthermalfe: -2256.480418 hartree
dipole: -1.1894 2.3170 3.6341
dipole: 4.4710
quadrupole: -228.6700 -210.9337 -198.7386
quadrupole: -26.1474 15.1885 -6.9927
quadrupole: -15.8893 1.8471 14.0422 -26.1474 15.1885 -6.9927
hfenergy: -2256.8141155 hartree
pointgroup: C01 [X(C21H21N5O5S2)]
dipole: -0.5262223 -1.0944561 1.2725765 debye
polarizability: 482.7064914|6.3872583|230.1983448|50.8033617|-9.7286073|301.745188 unknown
InChI: InChI=1S/C21H21N5O5S2/c22-8-12-4-2-1-3-11(12)7-15(28)23-17-19(29)26-18(21(30)31)13(10-33-20(17)26)9-32-16-6-5-14(27)24-25-16/h1-6,17,20,23-24,30H,7-10,22H2
charge 0 multiplicity 1
54 atoms
S  -0.619545 0.649097 -1.604411
S  -4.250598 -1.028468 0.928397
O  1.920589 1.130878 2.374623
O  -2.219628 1.655935 3.668596
O  3.979696 1.984781 -1.960027
O  -0.654094 -0.047091 3.442584
O  -8.448414 -0.743832 -3.262506
N  -0.03491 1.561218 0.952343
N  2.510851 0.591202 -0.779293
N  -5.809868 0.241733 -0.952677
N  2.970541 -1.82217 0.471724
N  -6.800642 0.223646 -1.914058
C  0.255538 1.863163 -0.476877
C  1.788712 1.678821 -0.168277
C  1.343624 1.401962 1.308748
C  -1.301342 1.246438 1.470568
C  -2.396917 1.126364 0.636265
C  -2.293631 1.211672 -0.879689
C  -3.774271 0.830176 1.157358
C  3.604995 0.829794 -1.597346
C  -1.327819 0.868012 2.927594
C  4.30738 -0.467272 -2.045659
C  5.520753 -0.887345 -1.210582
C  5.465802 -1.310277 0.158686
C  6.778565 -0.887999 -1.869356
C  -5.53512 -0.927051 -0.367843
C  4.232657 -1.266724 1.065153
C  6.670101 -1.732497 0.78382
C  7.966696 -1.296032 -1.227817
C  7.91113 -1.729165 0.113302
C  -6.219105 -2.156405 -0.713241
C  -7.200917 -2.136389 -1.681074
C  -7.566023 -0.888379 -2.365552
H  -0.045369 2.883969 -0.763079
H  2.362664 2.612178 -0.316547
H  -2.47169 2.241475 -1.239735
H  -3.052721 0.558418 -1.340702
H  2.434845 -0.403875 -0.402387
H  -3.885954 1.030794 2.230287
H  -4.548395 1.369788 0.585459
H  4.641957 -0.2916 -3.081597
H  3.560452 -1.28039 -2.068198
H  -2.198864 1.360284 4.620921
H  6.819581 -0.552931 -2.912283
H  4.489462 -1.791536 2.007615
H  4.010661 -0.218974 1.347429
H  6.631034 -2.064739 1.828706
H  8.918131 -1.278502 -1.770367
H  8.817413 -2.059239 0.632537
H  -5.948261 -3.083755 -0.198077
H  3.123862 -2.727911 0.008666
H  2.242196 -1.920955 1.194355
H  -7.746564 -3.036736 -1.97549
H  -6.995525 1.132643 -2.343993
