program: Gaussian 09
title: 000186782
version: EM64L-G09RevD.01
frameworkgroup: C1[X(C11H13NO6S)]
method: RPBEPBE
basis: SDD
operation: Freq
keyword: #p
keyword: freq=noraman
keyword: PBEPBE/SDD
title: #p freq=noraman PBEPBE/SDD
converged: YES YES NO NO
title: Mulliken charges:
elementType: S O O O O O O N C C C C C C C C C C C H H H H H H H H H H H H H
charge: 0.285727 -0.201485 -0.463312 -0.468934 -0.439449 -0.479682 -0.162076 -0.016715 -0.150644 -0.159186 -0.039686 -0.081605 -0.438860 0.143511 -0.190593 -0.189305 -0.160322 -0.346423 -0.190555 0.230822 0.242223 0.235881 0.250670 0.307168 0.370648 0.382081 0.365935 0.399644 0.247550 0.242647 0.240749 0.233575
chargesum: 0.00000
title: Mulliken charges with hydrogens summed into heavy atoms:
elementType: S O O O O O O N C C C C C C C C C C C
charge: 0.285727 -0.201485 -0.092663 -0.086852 -0.073515 -0.080037 -0.162076 -0.016715 0.080178 0.083037 0.196195 0.169066 -0.131693 0.143511 -0.190593 0.058245 0.082325 -0.105674 0.043019
polarizability: 2.20288386e+02 -1.69956117e+01 1.45147391e+02 5.00282078e+00 1.64037713e+01 1.27381584e+02
1716.lowfreq: -8.2847 -3.8778 -0.0011 -0.0005 0.0014 6.7336 16.3420 29.6523 39.4149
frequency: 16.2462 29.6405 39.4127 45.3693 72.9728 100.1029 125.2456 142.4084 171.2496 185.7831 219.4792 243.8693 268.8368 279.3964 291.5704 337.7581 361.3144 384.0566 397.1452 403.2537 423.0604 428.7980 444.9551 472.9897 491.7513 515.3700 536.8093 547.9903 556.3541 579.8266 611.6457 613.2885 681.9256 702.2662 737.7694 762.2323 786.7341 870.5457 882.0203 911.9892 950.5114 953.0717 960.7235 988.3842 991.5930 1001.9500 1022.6605 1033.7947 1044.8396 1052.8764 1056.7498 1063.5157 1081.4535 1085.6235 1114.9714 1164.6119 1165.4883 1209.5426 1215.7376 1227.7313 1248.8942 1254.0168 1267.5144 1283.8267 1305.2790 1308.7206 1317.5974 1320.5463 1340.3306 1376.9807 1388.2877 1402.0129 1402.1198 1434.7181 1555.0562 1570.6495 1707.6961 2932.3798 2959.4792 2976.1737 2993.1526 3010.6808 3134.0317 3143.7871 3161.1295 3177.5293 3484.4506 3520.5086 3535.7005 3559.9592
redmass: 7.3888 9.2023 4.7129 7.3245 6.8695 7.7380 8.8559 6.5023 6.3784 7.0751 4.6687 5.9152 4.7739 5.6639 6.2224 6.1008 7.3467 4.7865 4.7345 3.4096 4.1758 1.3450 1.2746 3.2380 3.2588 2.2825 1.8146 4.6509 3.3429 2.5905 7.0526 1.7984 3.7993 7.0248 3.1436 1.4319 5.7909 6.7574 1.2994 7.1276 1.4267 6.4523 6.1171 6.3620 1.3384 4.6512 4.5434 2.6949 3.0797 3.6238 2.7492 3.4571 1.9249 2.6080 2.7035 1.0753 1.2606 1.2994 1.1933 1.1504 1.3237 1.1599 1.4065 1.4954 1.1876 1.1968 1.2720 9.7304 1.3715 1.7455 1.5565 1.6032 1.8012 1.9349 5.9884 5.5768 9.8483 1.0798 1.0815 1.0843 1.0860 1.0851 1.0884 1.0892 1.0953 1.1014 1.0652 1.0642 1.0654 1.0656
irintensity: 0.7019 3.3922 1.8626 0.3421 2.5778 3.0832 1.1016 0.3874 1.0764 7.5048 4.2499 1.8728 7.2778 6.5622 4.2359 6.3852 7.3443 11.7811 7.2688 2.7747 22.7133 77.8759 192.5613 9.1120 2.1476 56.8400 41.3347 73.2596 58.9630 100.4996 4.3012 128.4796 28.1480 45.7876 8.6009 74.7185 60.4692 18.5511 0.2865 42.4174 0.3338 4.0798 4.2735 486.7757 1.7123 54.3224 18.9737 8.6122 84.2379 34.5180 30.4188 35.0931 12.9040 102.9613 66.7074 3.5500 4.9664 12.0277 2.7719 15.8508 12.7814 32.2807 7.8959 1.9905 25.9376 19.1117 56.7138 12.8251 19.1862 13.4242 17.4013 21.8447 31.6029 82.2631 17.9288 119.8956 207.5665 14.1613 7.8427 14.9140 69.7150 17.5606 13.0732 7.1112 15.7329 21.0037 94.1736 29.7199 18.1820 27.5670
temp: 298.150 k
press: 1.00000 atm
elementType: 16 8 8 8 8 8 8 7 6 6 6 6 6 6 6 6 6 6 6 1 1 1 1 1 1 1 1 1 1 1 1 1
symmnumber: 1
zpe: 616869.2 jmol-1
zpe.correction: 0.234953 hartree
zpe.thermalcorrener: 0.253356 hartree
zpe.thermalcorrenthalpy: 0.254300 hartree
zpe.thermalcorrgfe: 0.186317 hartree
zpe.sumelectzpe: -1329.652475 hartree
zpe.sumelectthermal: -1329.634073 hartree
zpe.sumelectthermalent: -1329.633129 hartree
zpe.sumelectthermalfe: -1329.701112 hartree
dipole: 0.7149 2.8535 1.6371
dipole: 3.3665
quadrupole: -87.0485 -117.1002 -118.0053
quadrupole: 4.7700 -1.4716 6.3264
quadrupole: 20.3361 -9.7155 -10.6206 4.7700 -1.4716 6.3264
hfenergy: -1329.8874284 hartree
pointgroup: C01 [X(C11H13N1O6S1)]
dipole: 0.1202303 -1.1253523 -0.688022 debye
polarizability: 222.9735164|8.172897|140.9786109|-5.9355342|17.091982|128.8652336 unknown
InChI: InChI=1S/C11H13NO6S/c13-6-7(14)9(10(16)17)18-11(8(6)15)19-5-3-1-2-4-12-5/h1-4,6-9,11,13-16H
charge 0 multiplicity 1
32 atoms
S  -1.187837 1.424154 1.346146
O  0.588616 -0.5155 0.767217
O  3.726792 2.027777 -0.313725
O  3.897615 -0.734546 -1.059436
O  1.08262 3.072593 -0.146834
O  2.952394 -3.123611 -0.166557
O  1.020449 -3.225387 1.124837
N  -2.378442 0.112821 -0.782706
C  2.568078 1.146165 -0.478609
C  2.904457 -0.297429 -0.078172
C  1.441926 1.758595 0.374183
C  1.587402 -1.133459 -0.11054
C  0.215973 0.837034 0.278002
C  1.758916 -2.569651 0.379788
C  -2.596449 0.67023 0.432392
C  -3.875119 0.723741 1.044793
C  -4.967917 0.173772 0.345913
C  -3.445464 -0.418487 -1.447452
C  -4.756654 -0.41207 -0.927365
H  2.2461 1.137264 -1.543761
H  3.318654 -0.318439 0.951945
H  1.792967 1.824325 1.426429
H  1.229641 -1.172022 -1.166149
H  -0.178583 0.76826 -0.754435
H  4.477918 1.63552 -0.828822
H  4.060442 -1.705816 -0.914193
H  1.928018 3.586306 -0.236966
H  3.045155 -4.067741 0.133889
H  -4.001774 1.174596 2.033834
H  -5.968379 0.19715 0.790394
H  -3.225727 -0.860485 -2.425655
H  -5.579993 -0.852062 -1.497283
