program: Gaussian 09
title: 000186589
version: EM64L-G09RevD.01
frameworkgroup: C1[X(C22H15NO3)]
method: RPBEPBE
basis: SDD
operation: Freq
keyword: #p
keyword: freq=noraman
keyword: PBEPBE/SDD
title: #p freq=noraman PBEPBE/SDD
converged: YES YES NO NO
title: Mulliken charges:
elementType: O O O N C C C C C C C C C C C C C C C C C C C C C C H H H H H H H H H H H H H H H
charge: -0.415507 -0.431585 -0.328961 -0.459610 0.023907 -0.046020 0.312488 0.404814 0.416741 0.492347 0.219471 0.173200 -0.315836 0.517689 -0.793015 -0.435304 -0.520138 -0.458659 -0.477546 -0.505704 -0.264929 -0.452316 0.289801 -0.414673 0.266409 -0.768540 0.301676 0.227488 0.236320 0.211095 0.244374 0.249120 0.225721 0.252126 0.315735 0.223562 0.382205 0.357363 0.218206 0.261586 0.264899
chargesum: 0.00000
title: Mulliken charges with hydrogens summed into heavy atoms:
elementType: O O O N C C C C C C C C C C C C C C C C C C C C C C
charge: -0.033302 -0.074222 -0.328961 -0.143875 0.023907 -0.046020 0.312488 0.404814 0.416741 0.492347 0.219471 0.173200 -0.315836 0.517689 -0.491340 -0.207816 -0.283818 -0.247563 -0.233171 -0.256584 -0.039208 -0.200190 0.289801 -0.191111 0.266409 -0.023850
polarizability: 4.98663932e+02 5.12053515e+01 3.40953166e+02 8.35080873e-01 -1.21188759e+00 1.03466059e+02
1716.lowfreq: -0.0007 -0.0007 0.0005 6.2145 9.1109 12.4714 40.8231 56.3426 74.5709
frequency: 40.7448 56.2889 74.5701 75.2786 82.9592 106.9910 131.0824 155.4465 183.3556 188.5423 217.4884 233.4895 251.7202 292.0970 314.9219 320.3551 336.5820 345.7093 356.4452 384.5127 405.3426 426.1213 437.0247 445.8861 463.0484 472.3659 513.4706 523.3131 526.8074 555.4701 569.8090 588.2625 593.3386 605.8506 607.5657 614.6672 634.3727 679.7943 686.1176 705.7077 717.6746 735.2425 766.9731 773.4211 787.6518 807.8358 823.3581 845.1722 850.9860 865.7845 888.3903 889.0432 899.3618 931.3572 933.6528 962.7723 967.4331 968.7183 982.6683 1000.3185 1007.5407 1028.9763 1044.6154 1068.2806 1076.1194 1102.2363 1142.7107 1151.1141 1170.9686 1195.9381 1208.7105 1216.1575 1240.7714 1249.0462 1266.9535 1285.5461 1305.2872 1314.6234 1327.4410 1345.7242 1393.6877 1396.1292 1409.9046 1416.7474 1422.6853 1436.2063 1440.8879 1445.8423 1447.5711 1465.3025 1472.9358 1489.7515 1498.7991 1511.8390 1523.4200 1565.3763 1582.4975 1595.8405 1604.7615 1605.7632 1625.6985 1641.6941 2603.7771 2999.5501 3096.4678 3105.9972 3115.4726 3116.9662 3128.9866 3132.8259 3146.3055 3156.0943 3161.5735 3161.9289 3177.3764 3505.2233 3585.7910
redmass: 5.7167 4.1431 2.6515 2.0141 2.9052 3.7465 5.7831 4.8837 5.3473 5.0083 4.1603 5.8909 4.7181 6.4461 4.8884 6.6841 1.1888 4.7761 5.3618 5.7165 4.7947 8.0698 3.5638 4.3823 5.7842 3.5025 5.0137 3.2582 5.5836 5.8996 3.5727 4.9779 4.7380 5.2930 5.6740 3.9251 4.1130 1.3871 6.9838 3.6596 5.7235 2.8438 2.0166 1.5517 6.2506 1.6107 5.8146 4.1418 1.9256 3.0581 2.2840 1.6205 4.2878 1.5427 4.6046 3.8408 1.5859 1.4482 1.4176 1.7440 1.2654 3.1007 1.6121 3.3467 3.2127 2.0920 1.6317 1.3477 1.3185 1.3110 1.4215 1.8243 1.8246 3.4423 1.9079 2.2877 2.5020 2.4031 3.9991 2.7874 3.2280 1.4424 3.5670 3.9714 3.1691 2.2744 3.2527 1.7306 1.6848 2.5823 1.5062 3.4795 3.3654 2.7526 4.5172 4.7070 5.2837 6.1756 3.0518 6.4369 7.0292 6.3931 1.0872 1.0362 1.0984 1.1004 1.0880 1.0860 1.0882 1.0896 1.0967 1.0991 1.0955 1.0914 1.0901 1.0759 1.0661
irintensity: 1.7453 2.4495 5.9293 0.2059 0.6632 1.1756 4.9739 4.2874 0.1631 0.2945 2.9179 2.0782 6.0389 5.7929 0.0111 3.3501 142.8104 5.5197 6.1363 2.3555 0.9384 3.5823 4.2864 0.3908 16.0359 3.1071 30.0901 5.1258 3.3824 6.0100 2.8921 5.3369 2.7521 2.2050 5.5240 7.0439 15.1087 65.6572 1.1144 12.1188 8.9929 13.4972 40.1552 4.4641 26.3403 13.6408 7.1930 18.2537 44.5943 1.5561 9.5913 33.8680 7.1842 12.6581 54.0940 3.8220 11.3709 4.5055 0.3018 7.6113 105.7096 7.4183 37.6225 11.6690 8.4059 9.3568 78.8801 279.0900 4.5230 10.0581 29.4781 33.4060 6.4954 44.7347 4.5600 50.3133 20.9307 17.8557 11.5767 56.5659 45.3494 33.2308 9.1239 4.0788 26.2843 100.4193 35.0024 15.7438 6.6350 7.8493 46.7150 193.4457 164.5013 71.7692 62.3223 36.5003 32.3997 19.7782 100.3934 21.5285 73.6905 115.5155 814.2212 12.7012 6.9070 13.3378 17.0508 14.4448 4.1117 18.6796 21.7058 41.9285 15.6750 0.0458 13.6586 31.6890 90.9230
temp: 298.150 k
press: 1.00000 atm
elementType: 8 8 8 7 6 6 6 6 6 6 6 6 6 6 6 6 6 6 6 6 6 6 6 6 6 6 1 1 1 1 1 1 1 1 1 1 1 1 1 1 1
symmnumber: 1
zpe: 816673.6 jmol-1
zpe.correction: 0.311055 hartree
zpe.thermalcorrener: 0.330944 hartree
zpe.thermalcorrenthalpy: 0.331888 hartree
zpe.thermalcorrgfe: 0.263431 hartree
zpe.sumelectzpe: -1126.090603 hartree
zpe.sumelectthermal: -1126.070713 hartree
zpe.sumelectthermalent: -1126.069769 hartree
zpe.sumelectthermalfe: -1126.138226 hartree
dipole: 1.6129 1.1446 -1.1703
dipole: 2.2981
quadrupole: -101.2016 -142.7409 -157.6540
quadrupole: 18.4693 -6.5988 2.5440
quadrupole: 32.6639 -8.8754 -23.7885 18.4693 -6.5988 2.5440
hfenergy: -1126.4016571 hartree
pointgroup: C01 [X(C22H15N1O3)]
dipole: 0.6563426 -0.3835554 0.4894891 debye
polarizability: 505.4474694|-38.0051623|333.568573|10.2416815|-9.8651251|104.0671141 unknown
InChI: InChI=1S/C22H15NO3/c1-11(24)23-21-16-4-2-3-12-6-8-15-17-10-14(25)7-5-13(17)9-18(22(21)26)20(15)19(12)16/h2-10,23,25-26H,1H3
charge 0 multiplicity 1
41 atoms
O  1.369371 2.886021 0.104588
O  -6.467189 -0.158681 -0.114122
O  3.764409 3.217182 -0.62087
N  3.736465 1.098023 0.373931
C  -0.281116 -0.462796 0.060112
C  0.858045 -1.341834 0.105267
C  -1.615442 -0.992722 0.040281
C  -0.068311 0.970488 0.017986
C  2.198939 -0.801806 0.117446
C  0.659945 -2.769219 0.120336
C  -2.752891 -0.086151 -0.019332
C  2.38406 0.646395 0.163969
C  1.286097 1.513363 0.079781
C  -2.502378 1.342246 -0.064871
C  -1.165971 1.837388 -0.045558
C  -1.778131 -2.424118 0.074063
C  -0.687175 -3.277776 0.111278
C  3.291731 -1.710838 0.094761
C  1.78664 -3.642864 0.136084
C  -4.106436 -0.539953 -0.0389
C  3.084223 -3.112006 0.111155
C  -3.613246 2.246856 -0.127417
C  -5.164913 0.371654 -0.099768
C  -4.926132 1.782106 -0.14517
C  4.366692 2.258778 -0.00798
C  5.840448 2.377967 0.336807
H  -0.980094 2.914818 -0.074999
H  -2.783988 -2.852943 0.064035
H  -0.83556 -4.363626 0.129047
H  4.323201 -1.349473 0.011803
H  1.626308 -4.726572 0.150361
H  -4.356811 -1.602649 -0.006601
H  3.950748 -3.781946 0.091375
H  -3.411219 3.32311 -0.161085
H  4.321771 0.422187 0.872355
H  -5.768227 2.484512 -0.193048
H  2.304681 3.199462 -0.239349
H  -7.142671 0.562536 -0.15702
H  6.265821 1.463502 0.784025
H  5.985703 3.218214 1.037957
H  6.400402 2.621266 -0.581914
