program: Gaussian 09
title: 000185777
version: EM64L-G09RevD.01
frameworkgroup: C1[X(C15H22O)]
method: RPBEPBE
basis: SDD
operation: Freq
keyword: #pfreq=noraman
keyword: PBEPBE/SDD
title: #p freq=noraman PBEPBE/SDD
converged: YES YES NO NO
title: Mulliken charges:
elementType: O C C C C C C C C C C C C C C C H H H H H H H H H H H H H H H H H H H H H H
charge: -0.234532 0.406179 -0.627593 -0.562035 -0.202004 -0.112183 -0.529124 0.410242 -0.554665 -0.734698 0.479917 -0.539883 0.174486 -0.843178 -0.825773 -0.734930 0.230354 0.221284 0.223448 0.215863 0.214856 0.214157 0.235007 0.228586 0.234043 0.245223 0.233109 0.224871 0.217170 0.253751 0.242126 0.233276 0.237703 0.221652 0.233533 0.227449 0.216296 0.226014
chargesum: 0.00000
title: Mulliken charges with hydrogens summed into heavy atoms:
elementType: O C C C C C C C C C C C C C C C
charge: -0.234532 0.406179 -0.175955 -0.122724 0.012852 0.101974 -0.065531 0.410242 -0.075399 -0.059547 0.479917 -0.286131 0.174486 -0.130073 -0.143139 -0.292620
polarizability: 1.96090412e+02 1.12534621e+01 1.49016371e+02 8.72832673e+00 2.02481763e+00 1.34215607e+02
1716.lowfreq: -12.1527 -7.0205 -0.0003 0.0003 0.0004 12.4288 36.5317 49.0402 54.9334
frequency: 36.4158 48.8727 54.8981 123.3714 140.4383 150.9210 158.4227 181.7094 195.9262 203.3898 227.8941 240.0810 274.9320 323.8323 326.3604 350.5880 355.0331 391.9762 429.3393 461.7229 486.6363 501.1686 526.2626 533.6832 550.9354 583.4573 607.7009 644.3802 696.5165 713.7928 808.9401 814.9155 834.3328 859.4507 874.2989 894.3789 911.2582 926.3591 931.3669 953.5017 982.4755 987.1471 998.8685 1003.9076 1016.5692 1027.5052 1040.9258 1046.9175 1056.5747 1076.7753 1084.7958 1115.4994 1117.7951 1141.9596 1184.5340 1192.7407 1207.9301 1241.9671 1242.4233 1258.7594 1269.4283 1274.3169 1288.5676 1299.9652 1308.5498 1319.7262 1338.7799 1348.0094 1354.5748 1392.5964 1393.6350 1395.1052 1427.6994 1444.7804 1452.7483 1459.1518 1463.7522 1471.8098 1476.5291 1478.1040 1483.5645 1484.3218 1491.8703 1582.1783 1622.0391 1664.7285 2922.8378 2964.4573 2965.5825 2971.8242 2983.4086 2986.0766 2993.9638 2995.9449 3000.6596 3039.1406 3045.5664 3057.0740 3058.8207 3062.5560 3069.9033 3075.5274 3084.2831 3086.6390 3088.5549 3098.1926 3123.6501 3197.7310
redmass: 3.0229 5.4875 3.2625 1.8367 2.8712 2.1498 1.9075 1.1998 1.0822 2.6189 2.6323 2.7597 2.9593 2.8873 2.3340 2.9916 2.4722 2.7025 2.6847 2.7060 3.5307 2.6460 2.4805 3.1971 2.5029 3.1161 3.1012 3.5749 1.2643 2.1918 2.1402 2.3899 2.0648 2.1354 1.6983 2.0510 2.2542 1.6373 1.3275 1.6933 1.7045 1.9697 1.7945 1.5501 1.8092 1.7467 1.4555 1.6516 1.7641 2.3718 1.7698 1.8321 3.0997 2.6364 1.6453 1.4083 1.4717 1.7762 1.5161 1.9581 1.4327 1.5126 1.5502 1.4730 1.5595 1.4195 1.7397 1.9656 1.7546 1.2223 1.2029 1.2304 1.1892 1.0792 1.0588 1.0774 1.0581 1.0789 1.0621 1.0586 1.0724 1.0663 1.0711 9.3122 6.6323 4.9419 1.0813 1.0804 1.0376 1.0384 1.0494 1.0540 1.0615 1.0628 1.0627 1.0964 1.0951 1.0974 1.0982 1.1001 1.1030 1.0989 1.0992 1.0982 1.0987 1.0630 1.0914 1.1129
irintensity: 0.1773 3.3809 0.6708 0.3628 0.9473 0.7676 0.5497 0.4843 0.1451 0.4148 0.3161 0.8751 0.2570 2.0247 0.0594 3.6692 3.7703 1.0350 2.0259 4.1973 3.1036 2.0190 4.3049 0.3528 2.2935 1.8114 2.0375 1.9857 0.7744 0.2542 0.8831 2.8161 1.8681 6.2544 5.1854 13.1643 4.5710 11.1793 59.7781 11.6207 8.9867 3.5769 0.6197 0.4536 5.3418 1.6506 1.1398 4.4995 4.9787 3.4979 2.6714 5.8677 4.6615 2.0741 7.6600 1.2189 9.4465 4.0590 19.6519 10.5334 16.6961 18.4816 16.7030 5.7860 16.6377 0.2525 19.9209 1.1683 5.2739 26.0487 25.0210 30.7222 1.1201 15.4434 8.6491 13.6430 24.0262 3.9737 36.1773 5.4843 5.3875 1.1907 8.0031 156.7977 162.0681 30.8780 17.6349 25.3154 29.8981 17.9014 34.1706 9.3002 38.0973 40.8610 6.6718 25.2007 11.5805 26.6485 29.0554 7.5967 55.1390 42.6756 32.3018 32.9718 17.8059 8.0796 12.2379 29.4115
temp: 298.150 k
press: 1.00000 atm
elementType: 8 6 6 6 6 6 6 6 6 6 6 6 6 6 6 6 1 1 1 1 1 1 1 1 1 1 1 1 1 1 1 1 1 1 1 1 1 1
symmnumber: 1
zpe: 868575.3 jmol-1
zpe.correction: 0.330823 hartree
zpe.thermalcorrener: 0.347376 hartree
zpe.thermalcorrenthalpy: 0.348321 hartree
zpe.thermalcorrgfe: 0.287383 hartree
zpe.sumelectzpe: -658.756309 hartree
zpe.sumelectthermal: -658.739756 hartree
zpe.sumelectthermalent: -658.738812 hartree
zpe.sumelectthermalfe: -658.799749 hartree
dipole: 4.7261 2.6970 0.6674
dipole: 5.4823
quadrupole: -119.3288 -100.3823 -93.9783
quadrupole: -7.2790 -1.7027 -1.7973
quadrupole: -14.7657 4.1808 10.5848 -7.2790 -1.7027 -1.7973
hfenergy: -659.0871324 hartree
pointgroup: C01 [X(C15H22O1)]
dipole: 1.8798669 0.6829084 0.8074128 debye
polarizability: 196.9324666|4.3621901|141.1505978|11.6847205|7.7281319|141.2393249 unknown
InChI: InChI=1S/C15H22O/c1-10(2)13-5-6-15(9-13)11(3)7-14(16)8-12(15)4/h7,12-13H,1,5-6,8-9H2,2-4H3
charge 0 multiplicity 1
38 atoms
O  -4.162252 -0.975898 -1.043051
C  -0.339827 0.323869 0.369289
C  0.733004 -0.181644 -0.689699
C  0.541732 1.069461 1.442018
C  -1.366604 1.320399 -0.282326
C  2.086074 0.483472 -0.32618
C  1.999242 0.607451 1.224327
C  -1.078167 -0.907362 0.92746
C  -2.29206 0.587826 -1.287223
C  -2.22879 2.081058 0.757572
C  3.349942 -0.193967 -0.84993
C  -2.301976 -1.29608 0.437465
C  -3.018839 -0.593157 -0.64365
C  -0.395625 -1.752635 1.983959
C  4.660322 0.417082 -0.376409
C  3.33645 -1.250084 -1.707247
H  0.418982 0.046446 -1.723281
H  0.838886 -1.280605 -0.622753
H  0.185772 0.927634 2.476879
H  0.491662 2.156121 1.235933
H  -0.769796 2.06986 -0.84426
H  2.084519 1.523319 -0.726647
H  2.731306 1.321508 1.641652
H  2.188575 -0.3796 1.687847
H  -1.705291 0.186989 -2.138767
H  -3.045994 1.272017 -1.716311
H  -2.857485 1.388135 1.345162
H  -1.611686 2.662042 1.464425
H  -2.903503 2.789201 0.24236
H  -2.803519 -2.188532 0.832974
H  -1.01799 -2.618036 2.266516
H  -0.177464 -1.172611 2.899912
H  0.576273 -2.136875 1.617608
H  4.689624 1.504738 -0.585938
H  4.786798 0.300246 0.717312
H  5.527668 -0.052044 -0.871067
H  4.26901 -1.69597 -2.07315
H  2.407824 -1.696274 -2.07768
