program: Gaussian 09
title: 000180076
version: EM64L-G09RevD.01
frameworkgroup: C1[X(C8H15O3PS)]
method: RPBEPBE
basis: SDD
operation: Freq
keyword: #p
keyword: freq=noraman
keyword: PBEPBE/SDD
title: #p freq=noraman PBEPBE/SDD
converged: YES YES NO NO
title: Mulliken charges:
elementType: S P O O O C C C C C C C C H H H H H H H H H H H H H H H
charge: -0.157826 0.877524 -0.469095 -0.427551 -0.430057 0.081235 0.025596 -0.442895 -0.317637 -0.310892 -0.381504 -0.724401 -0.686687 0.252954 0.202396 0.212449 0.229249 0.230060 0.237411 0.233856 0.210415 0.205002 0.255940 0.224252 0.218212 0.212002 0.213519 0.226475
chargesum: 0.00000
title: Mulliken charges with hydrogens summed into heavy atoms:
elementType: S P O O O C C C C C C C C
charge: -0.157826 0.877524 -0.469095 -0.427551 -0.430057 0.081235 0.278549 -0.028050 0.141672 0.160374 0.033913 -0.025998 -0.034691
polarizability: 1.92029067e+02 -5.40579305e-01 1.06532879e+02 6.01821943e+00 -4.11004801e-01 1.00169108e+02
1716.lowfreq: -10.6070 -8.8766 -0.0026 -0.0017 -0.0014 9.7218 59.9148 88.0616 97.9252
frequency: 59.8811 88.0485 97.9181 127.7327 143.1772 157.3580 214.3765 216.9379 224.6286 256.0131 263.9333 273.1964 311.3544 320.5655 348.8081 382.6220 389.4703 404.0856 445.1383 527.0057 562.4658 639.4107 643.0213 661.0662 725.5391 736.6431 762.8518 823.6767 847.5018 879.9901 900.9344 906.6664 926.7241 945.5917 1006.3540 1036.1712 1048.6529 1053.8366 1087.7253 1117.6739 1133.6676 1147.7063 1160.4281 1196.3764 1225.3128 1266.6635 1280.9894 1299.6346 1302.5476 1321.0156 1338.1975 1349.0193 1360.0678 1392.9840 1395.1039 1449.1608 1457.8150 1465.1388 1471.3727 1474.0004 1475.9805 1479.5524 1489.9942 2965.1746 2977.1629 2990.1007 2999.9770 3004.2641 3005.6976 3012.0398 3014.0340 3041.4526 3074.3430 3082.1796 3083.1089 3092.4191 3098.9186 3102.6543
redmass: 2.2815 4.2249 3.3708 3.6986 3.2924 5.0782 1.1178 1.2793 2.5092 3.0605 3.7063 2.1395 8.2466 4.8168 4.7735 3.1389 4.8900 5.0958 4.9089 3.9708 5.7827 7.0259 5.0487 6.6137 5.6665 1.1902 3.3044 4.6726 1.5499 2.8729 3.8747 1.9231 2.0446 3.2912 1.6289 2.4013 1.6373 2.3115 2.0181 2.1404 2.6124 1.6793 1.5392 1.6062 1.4778 1.2318 1.3128 1.1592 1.4033 1.2383 1.3485 1.4234 1.4545 1.2093 1.2297 1.0703 1.0749 1.0718 1.0741 1.0510 1.0438 1.0468 1.0888 1.0604 1.0364 1.0605 1.0372 1.0773 1.0692 1.0802 1.0747 1.1018 1.1016 1.0992 1.1077 1.1040 1.0994 1.0993
irintensity: 0.5352 0.8983 0.6678 2.0746 0.4894 2.1238 0.1222 0.4117 2.6470 5.7626 2.2502 0.1037 11.4308 8.1691 5.1345 3.9875 4.9379 3.4844 0.7433 5.8491 10.1077 67.4274 37.0907 68.7026 109.2605 29.4733 97.3242 136.0246 0.7320 31.5423 12.3683 38.7375 84.7207 103.1200 12.4828 48.9471 4.2747 31.9338 10.4780 4.0268 4.6548 6.6560 5.4002 3.1873 3.2363 2.7620 1.4246 1.2164 0.6092 2.1975 8.0131 8.2208 0.7769 13.9581 26.7362 3.3078 6.5760 6.6247 3.4828 11.5986 12.8570 1.7040 18.7468 12.8730 38.4131 29.4342 11.4915 31.4283 26.4012 11.5588 43.4075 16.3441 67.9429 36.4123 23.9409 13.8027 30.2264 13.6621
temp: 298.150 k
press: 1.00000 atm
elementType: 16 15 8 8 8 6 6 6 6 6 6 6 6 1 1 1 1 1 1 1 1 1 1 1 1 1 1 1
symmnumber: 1
zpe: 592396.8 jmol-1
zpe.correction: 0.225632 hartree
zpe.thermalcorrener: 0.240022 hartree
zpe.thermalcorrenthalpy: 0.240966 hartree
zpe.thermalcorrgfe: 0.185141 hartree
zpe.sumelectzpe: -1277.745182 hartree
zpe.sumelectthermal: -1277.730792 hartree
zpe.sumelectthermalent: -1277.729847 hartree
zpe.sumelectthermalfe: -1277.785672 hartree
dipole: 8.0108 0.1536 0.8059
dipole: 8.0527
quadrupole: -102.9488 -93.9662 -95.6292
quadrupole: -1.1032 -0.3449 -0.4360
quadrupole: -5.4341 3.5486 1.8855 -1.1032 -0.3449 -0.4360
hfenergy: -1277.9708138 hartree
pointgroup: C01 [X(C8H15O3P1S1)]
dipole: 3.1417822 0.1604875 0.3752452 debye
polarizability: 191.7118067|2.0857606|106.5408194|7.8181936|-0.4476404|100.4784278 unknown
InChI: InChI=1S/C8H15O3PS/c1-3-4-8-5-9-12(13,10-6-8)11-7(8)2/h7H,3-6H2,1-2H3
charge 0 multiplicity 1
28 atoms
S  -4.301928 -0.165137 -0.427434
P  -2.300083 -0.182114 -0.121541
O  -1.397827 1.286944 -0.423522
O  -1.717867 -0.557824 1.492792
O  -1.333631 -1.314624 -1.050957
C  0.494171 -0.201861 0.310981
C  0.101222 1.063312 -0.533663
C  2.020232 -0.280212 0.607982
C  -0.280214 -0.162567 1.663943
C  0.037076 -1.475617 -0.464059
C  2.971539 -0.275667 -0.615779
C  0.705846 2.39984 -0.105055
C  4.452077 -0.285197 -0.177268
H  0.30677 0.867852 -1.604167
H  2.210332 -1.202834 1.19549
H  2.292694 0.564469 1.272297
H  0.122798 -0.903592 2.375261
H  -0.251394 0.843895 2.119857
H  0.677003 -1.67752 -1.337492
H  0.026215 -2.356044 0.206151
H  2.78152 0.613883 -1.246674
H  2.778367 -1.158821 -1.254438
H  0.23062 3.207036 -0.68744
H  0.526397 2.606325 0.964007
H  1.792215 2.428622 -0.297541
H  4.693791 0.607608 0.429558
H  4.67919 -1.177941 0.435117
H  5.129169 -0.294013 -1.049803
