program: Gaussian 09
title: 000179077
version: EM64L-G09RevD.01
frameworkgroup: C1[X(C13H12ClN3O)]
method: RPBEPBE
basis: SDD
operation: Freq
keyword: #p
keyword: freq=noraman
keyword: PBEPBE/SDD
title: #p freq=noraman PBEPBE/SDD
converged: NO YES NO NO
title: Mulliken charges:
elementType: Cl O N N N C C C C C C C C C C C C C H H H H H H H H H H H H
charge: 0.069327 -0.270807 -0.376333 -0.209063 -0.032966 -0.095620 -0.481762 -0.500196 0.216133 0.249065 -0.280873 -0.430119 0.484510 -0.358594 -0.369046 -0.209152 -0.206046 -0.240777 0.278018 0.249535 0.234323 0.230866 0.248624 0.300971 0.263771 0.265161 0.270415 0.233224 0.233187 0.234224
chargesum: 0.00000
title: Mulliken charges with hydrogens summed into heavy atoms:
elementType: Cl O N N N C C C C C C C C C C C C C
charge: 0.069327 -0.270807 -0.075362 -0.209063 -0.032966 0.182398 0.002096 -0.020706 0.216133 0.249065 -0.280873 -0.166349 0.484510 -0.093432 -0.098631 0.024072 0.027141 -0.006553
polarizability: 2.82057136e+02 9.41512761e+00 1.65452774e+02 4.62234624e+00 -7.45392841e+00 9.42666482e+01
1716.lowfreq: -7.6832 -0.0017 -0.0003 0.0015 1.3300 3.5103 13.0336 27.8783 43.3415
frequency: 2.2033 27.8772 43.3282 48.0276 63.1446 87.7791 121.5062 164.6850 187.2926 234.9257 239.3503 243.1980 313.8333 344.1208 377.7199 407.8367 414.3686 437.8582 480.3838 531.0644 538.9251 560.0750 609.9236 636.8026 641.7563 688.3679 695.8544 739.1396 751.6120 768.2366 783.4446 797.6047 838.1747 844.4197 857.0066 915.7863 920.7652 930.1458 952.4147 976.1295 989.6735 995.9269 1016.7900 1031.6428 1037.8474 1051.8002 1057.6210 1090.1909 1110.9019 1148.8390 1162.7424 1174.4575 1176.6107 1188.1690 1201.3409 1222.6198 1249.8059 1314.7125 1325.5445 1351.9026 1382.6745 1387.0674 1399.6651 1439.7590 1447.2248 1464.6246 1488.8511 1497.0950 1532.4197 1599.0214 1600.0305 1611.5334 3091.0549 3100.6302 3135.4673 3147.2502 3163.3151 3170.3411 3177.9863 3183.3662 3191.0502 3208.7551 3210.9018 3548.0974
redmass: 2.8745 5.6476 5.7860 5.7441 4.5392 4.1273 5.7693 7.2027 6.0868 5.9039 5.4272 8.7995 6.2327 5.3144 3.8294 2.8904 2.5208 8.3449 5.1477 3.9635 1.5249 4.0918 6.6847 5.7404 8.7325 6.2294 2.0633 5.3954 1.1717 1.6827 4.7648 1.5289 1.4603 1.2468 2.2647 2.8629 1.7430 2.8968 3.4333 1.3819 6.2379 1.3237 3.9382 2.3627 1.4964 3.0096 1.2717 1.6118 1.1734 2.3468 1.4008 1.0759 2.4216 1.1692 2.6299 1.8285 2.2456 2.5367 1.4965 2.0592 4.5899 9.3791 5.8638 1.0873 2.3539 1.2789 2.5106 2.3358 7.0904 6.7530 7.0519 6.1105 1.0523 1.0623 1.0855 1.0902 1.0953 1.0918 1.0954 1.0988 1.1167 1.0973 1.1134 1.0774
irintensity: 0.7137 4.7318 2.5582 1.3944 1.0358 0.3485 0.2679 1.8006 1.2488 5.0750 4.9684 3.0970 10.1013 2.2297 3.2256 0.4685 3.2135 0.7594 1.6612 37.1376 45.0804 14.3883 0.6035 11.2726 9.6513 5.0922 40.7914 11.1911 1.6608 67.3369 26.8639 18.1438 15.8647 0.3613 13.4088 20.1989 22.5210 56.2250 33.1343 0.3883 0.2988 0.2282 4.5692 5.8461 7.7137 5.6118 12.7675 7.3061 1.4766 2.3246 1.1787 0.9774 12.3183 2.3622 21.9642 2.3866 129.4810 17.7586 0.4612 67.4113 44.1952 0.4649 48.0888 9.1386 7.2966 9.6465 178.9294 101.9979 332.9543 43.5674 144.1617 19.4583 20.1754 9.0275 0.1199 13.9717 30.8420 5.9471 5.4493 2.9308 0.9704 1.9532 28.0916 15.0910
temp: 298.150 k
press: 1.00000 atm
elementType: 17 8 7 7 7 6 6 6 6 6 6 6 6 6 6 6 6 6 1 1 1 1 1 1 1 1 1 1 1 1
symmnumber: 1
zpe: 593912.5 jmol-1
zpe.correction: 0.226209 hartree
zpe.thermalcorrener: 0.242370 hartree
zpe.thermalcorrenthalpy: 0.243314 hartree
zpe.thermalcorrgfe: 0.177400 hartree
zpe.sumelectzpe: -1200.787246 hartree
zpe.sumelectthermal: -1200.771085 hartree
zpe.sumelectthermalent: -1200.770140 hartree
zpe.sumelectthermalfe: -1200.836054 hartree
dipole: 0.5669 -2.9238 1.0789
dipole: 3.1677
quadrupole: -84.0256 -112.1166 -114.0960
quadrupole: 11.9942 -0.1293 -3.4115
quadrupole: 19.3871 -8.7038 -10.6833 11.9942 -0.1293 -3.4115
hfenergy: -1201.013455 hartree
pointgroup: C01 [X(C13H12Cl1N3O1)]
dipole: -0.2424843 -1.1071799 0.5181809 debye
polarizability: 280.7937682|-0.920732|136.2786969|17.4835641|-35.8260587|124.7040927 unknown
InChI: InChI=1S/C13H12ClN3O/c14-12-11(13(18)16-9-6-7-9)8-15-17(12)10-4-2-1-3-5-10/h1-5,8-9,16H,6-7H2
charge 0 multiplicity 1
30 atoms
Cl -0.461329 1.478059 -1.901843
O  2.57237 1.841123 -0.823738
N  3.385965 0.056422 0.44065
N  -1.255688 0.108496 0.39971
N  -0.755197 -0.549442 1.539257
C  4.775711 0.369033 0.1963
C  5.765502 -0.714239 -0.255782
C  5.860073 -0.111743 1.162508
C  2.354816 0.834438 -0.079504
C  0.991295 0.393329 0.323909
C  -0.220367 0.672412 -0.334972
C  0.59054 -0.363898 1.473213
C  -2.67407 0.077167 0.160033
C  -3.351322 1.206342 -0.356919
C  -3.382746 -1.100717 0.495907
C  -4.745726 1.13718 -0.567438
C  -4.776782 -1.152114 0.290735
C  -5.462705 -0.038383 -0.248286
H  4.870959 1.362108 -0.248433
H  6.521534 -0.442158 -0.997211
H  5.394538 -1.740264 -0.346856
H  5.558891 -0.746547 2.003014
H  6.683038 0.569694 1.393974
H  3.157224 -0.795378 0.955433
H  1.207714 -0.747219 2.285204
H  -2.807782 2.128515 -0.577882
H  -2.838152 -1.948533 0.919746
H  -5.27146 2.009859 -0.969082
H  -5.326243 -2.063384 0.549775
H  -6.544799 -0.083862 -0.41072
