program: Gaussian 09
title: 000183914
version: EM64L-G09RevD.01
frameworkgroup: C1[X(C21H22O7)]
method: RPBEPBE
basis: SDD
operation: Freq
keyword: #pfreq=noraman
keyword: PBEPBE/SDD
title: #p freq=noraman PBEPBE/SDD
converged: YES YES NO NO
title: Mulliken charges:
elementType: O O O O O O O C C C C C C C C C C C C C C C C C C C C C H H H H H H H H H H H H H H H H H H H H H H
charge: -0.269158 -0.325198 -0.465622 -0.215060 -0.269978 -0.269597 -0.192108 0.283979 -0.101450 -0.299953 -0.745034 -0.725289 0.207719 0.024613 0.035398 0.326597 0.503853 -0.652140 0.236294 -0.378095 -0.266984 -0.154467 -0.481243 -0.307121 0.130401 0.454219 -0.778960 -0.801258 0.242232 0.260778 0.258191 0.203486 0.238938 0.235643 0.231973 0.193576 0.249269 0.374632 0.259961 0.270621 0.248618 0.271178 0.260667 0.255711 0.228455 0.240123 0.228034 0.302194 0.223319 0.218045
chargesum: 0.00000
title: Mulliken charges with hydrogens summed into heavy atoms:
elementType: O O O O O O O C C C C C C C C C C C C C C C C C C C C C
charge: -0.269158 -0.325198 -0.090990 -0.215060 -0.269978 -0.269597 -0.192108 0.283979 0.140782 0.219016 -0.066967 -0.050471 0.207719 0.024613 0.035398 0.326597 0.503853 -0.392180 0.236294 -0.107474 -0.018366 0.116711 -0.220576 -0.051410 0.130401 0.454219 -0.082348 -0.057700
polarizability: 2.61949784e+02 1.81790298e+01 3.23692444e+02 1.24826023e+01 -9.32464240e+00 2.24458242e+02
1716.lowfreq: -1.6290 -0.0007 -0.0005 0.0007 2.7701 5.4475 10.2931 12.3708 24.1859
frequency: 10.2799 12.3409 24.1685 40.3698 52.4820 60.5601 67.3703 74.0687 78.3071 87.8830 110.1948 122.5232 130.1760 159.1643 171.4711 187.8880 193.5552 199.2141 214.8456 228.0023 233.9156 249.8711 268.0711 279.0095 288.9541 303.5871 345.0488 363.8119 370.7306 371.6054 377.9006 389.7482 405.5810 407.4271 430.8925 463.9677 469.9717 471.9032 495.2350 516.0504 535.6866 544.9873 551.7037 584.1157 620.6601 641.7281 686.6775 692.1004 702.1167 703.7912 718.0695 743.2349 760.4973 768.9285 792.8896 802.7047 814.1327 824.2704 838.7632 854.1824 863.4968 868.3361 876.4304 888.0754 897.0186 923.1516 933.4846 938.3428 950.3235 957.8961 987.3295 988.8768 989.1729 991.0603 1028.4615 1040.5701 1057.8893 1062.3514 1081.2232 1087.3043 1105.4988 1117.7319 1119.1877 1134.8317 1172.8067 1185.2317 1201.7830 1205.0085 1232.4961 1235.5620 1237.1502 1275.6707 1280.6416 1328.1581 1331.2185 1362.1671 1365.0081 1367.9599 1377.2622 1388.4207 1390.3641 1395.1960 1396.5812 1412.2036 1429.9356 1448.8883 1449.8324 1451.8052 1456.3825 1457.0147 1467.6154 1470.7308 1473.7171 1485.0399 1490.5134 1528.5156 1581.6474 1605.3380 1609.4138 1628.2073 1661.1205 1690.1238 2966.0211 2971.0467 2978.9658 2993.6747 3009.8428 3036.2016 3038.7611 3043.4284 3076.5368 3093.0907 3094.6442 3095.9202 3110.4844 3111.3296 3126.2948 3135.3887 3145.6312 3156.5788 3189.0207 3226.5285 3270.3475 3496.8525
redmass: 6.0041 5.1127 3.7491 5.1321 5.4008 5.9437 3.8040 2.3054 1.3529 4.8165 5.3866 5.3280 4.2276 1.5478 7.3296 1.6604 4.7770 1.5890 2.4505 2.8654 4.4452 2.0765 2.5505 4.2351 4.9758 4.0056 2.5711 3.5589 4.0656 4.5538 5.8691 3.0976 5.6893 4.4951 2.9685 2.4285 1.4220 2.9265 2.9233 3.1243 5.5406 6.0959 5.1927 4.2445 7.0413 4.4685 4.8053 4.5210 5.1197 7.1096 6.0792 3.5352 5.6327 1.5671 6.9939 3.8218 6.0439 1.4833 4.5985 5.7792 1.3730 2.8250 1.4602 1.6123 2.7493 2.1496 2.2043 2.4946 3.0454 2.0797 1.2332 1.3325 2.1399 1.9134 2.2163 3.5123 2.1122 2.0985 2.9444 1.7415 4.1649 2.0972 1.5283 1.6485 1.9704 2.8148 1.4825 1.5707 2.0224 2.2734 2.3113 1.7740 1.5926 2.1010 1.4920 1.4444 1.4138 1.3380 1.4282 1.3684 1.5537 1.7645 1.2221 5.9821 6.6570 1.2386 1.0743 2.0077 1.0503 1.3233 1.1062 1.0699 1.0719 1.0466 1.0531 5.2577 9.7683 9.3441 7.4426 8.6883 5.8190 10.9178 1.0386 1.0387 1.0370 1.0368 1.0808 1.0956 1.0595 1.0955 1.0979 1.0994 1.0990 1.0995 1.1075 1.1002 1.0973 1.0905 1.0908 1.0929 1.0955 1.0932 1.1073 1.0653
irintensity: 0.5208 0.8553 0.4754 3.4973 2.0264 2.2891 1.2340 1.5139 0.2055 2.7108 1.1800 3.4203 0.2396 0.9495 0.4867 1.0837 1.8507 0.8039 2.0342 3.4093 1.4278 1.8159 6.5795 1.6912 8.2474 5.1553 1.3415 0.9376 1.6144 0.7197 1.5432 5.2897 8.7429 7.4959 12.5711 5.5499 85.4743 33.1018 34.2355 15.7113 3.6852 4.2070 12.6575 0.2338 6.4989 1.5334 5.1419 0.8376 5.5420 42.7399 14.3758 40.1132 10.7046 36.6166 17.4331 3.7377 3.9262 7.3727 3.2656 16.3511 9.7625 10.4983 25.7023 65.5819 11.8129 63.7574 27.8989 38.3963 66.8124 25.5072 7.8372 1.0790 30.5628 21.4379 138.6463 70.4918 52.1842 263.1645 64.5617 6.7330 143.4272 135.6363 93.6863 44.7696 48.5069 16.4836 37.5087 35.4762 8.8952 71.4646 19.7748 3.3240 9.7137 83.6548 66.8702 10.6904 10.2055 35.2601 41.0181 42.6961 108.1493 17.9557 23.9419 72.5736 48.5327 13.0599 28.4025 21.0652 7.0449 9.1273 55.8957 11.3721 1.3937 28.0643 13.2469 2.9570 131.7951 115.9977 10.4840 53.0841 208.9592 524.2504 6.5866 54.8283 17.0723 22.5313 13.9115 4.5173 9.8009 31.5588 22.6871 21.7625 21.7774 36.9701 7.8001 33.5767 1.7558 10.2730 4.5054 3.3572 2.5192 2.8725 0.4954 160.3558
temp: 298.150 k
press: 1.00000 atm
elementType: 8 8 8 8 8 8 8 6 6 6 6 6 6 6 6 6 6 6 6 6 6 6 6 6 6 6 6 6 1 1 1 1 1 1 1 1 1 1 1 1 1 1 1 1 1 1 1 1 1 1
symmnumber: 1
zpe: 1014976.1 jmol-1
zpe.correction: 0.386584 hartree
zpe.thermalcorrener: 0.414290 hartree
zpe.thermalcorrenthalpy: 0.415234 hartree
zpe.thermalcorrgfe: 0.325552 hartree
zpe.sumelectzpe: -1337.913818 hartree
zpe.sumelectthermal: -1337.886113 hartree
zpe.sumelectthermalent: -1337.885168 hartree
zpe.sumelectthermalfe: -1337.974850 hartree
dipole: -2.4149 3.9292 -5.1050
dipole: 6.8798
quadrupole: -132.4102 -172.1144 -154.8497
quadrupole: -10.0591 2.1618 -8.7298
quadrupole: 20.7146 -18.9896 -1.7249 -10.0591 2.1618 -8.7298
hfenergy: -1338.3004024 hartree
pointgroup: C01 [X(C21H22O7)]
dipole: 0.1591364 2.697164 -0.1620932 debye
polarizability: 254.5097315|4.1891278|263.4390875|32.6890625|-40.1390226|292.1516516 unknown
InChI: InChI=1S/C21H22O7/c1-12(2)9-17(23)27-15(21(3,4)24)11-26-20-18-14(7-8-25-18)10-13-5-6-16(22)28-19(13)20/h5-10,15,24H,11H2,1-4H3
charge 0 multiplicity 1
50 atoms
O  -2.179623 -1.12224 -0.52755
O  0.80943 -0.588394 -0.663493
O  -0.565089 -1.824033 -2.753194
O  0.978903 1.660593 -2.417324
O  2.352137 -0.428817 1.786958
O  -2.875353 -1.485366 1.675936
O  3.035158 -1.423587 3.750512
C  -0.811648 -2.806476 -1.684012
C  -1.085497 -2.109092 -0.313558
C  0.105871 -1.42074 0.36038
C  0.409465 -3.751679 -1.550645
C  -2.061493 -3.581948 -2.139216
C  1.566251 0.512097 -0.287103
C  1.646074 1.593381 -1.185906
C  2.350803 0.64958 0.889729
C  2.421858 2.773697 -0.972675
C  3.131364 1.83018 1.149699
C  3.167141 2.898366 0.2163
C  -3.039911 -0.898783 0.570979
C  2.205198 3.604924 -2.150157
C  3.882896 1.861495 2.389093
C  1.350954 2.913148 -2.979069
C  -4.070332 0.07761 0.174063
C  3.872506 0.812947 3.280195
C  3.111019 -0.408695 3.035046
C  -5.087121 0.554382 0.962466
C  -6.067778 1.561993 0.394051
C  -5.3307 0.14897 2.400366
H  -1.444597 -2.864434 0.413607
H  0.818438 -2.16038 0.758918
H  -0.242298 -0.779073 1.186906
H  0.271578 -4.502814 -0.749395
H  1.335324 -3.184336 -1.351401
H  0.542326 -4.285736 -2.506854
H  -1.881559 -3.985484 -3.149979
H  -2.287369 -4.420522 -1.455359
H  -2.929942 -2.905246 -2.187354
H  0.01771 -1.105817 -2.386597
H  3.769491 3.787182 0.427754
H  2.6337 4.585258 -2.347404
H  4.477087 2.756239 2.609345
H  0.912908 3.120268 -3.951487
H  -3.976133 0.42746 -0.859777
H  4.439198 0.837039 4.214087
H  -7.103938 1.176485 0.463043
H  -5.856157 1.806556 -0.660032
H  -6.043769 2.500067 0.982903
H  -4.564194 -0.544127 2.77369
H  -6.324478 -0.333424 2.491088
H  -5.361609 1.048023 3.046929
