program: Gaussian 09
title: 000228604
version: EM64L-G09RevD.01
frameworkgroup: C1[X(C7H12O)]
method: RPBEPBE
basis: SDD
operation: Freq
keyword: #pfreq=noraman
keyword: PBEPBE/SDD
title: #p freq=noraman PBEPBE/SDD
converged: YES YES NO NO
title: Mulliken charges:
elementType: O C C C C C C C H H H H H H H H H H H H
charge: -0.213153 -0.527668 -0.505077 0.556723 0.237259 -0.820762 -0.768102 -0.748780 0.228597 0.227658 0.239217 0.245306 0.230120 0.225916 0.219537 0.240983 0.230647 0.256698 0.224829 0.220053
chargesum: 0.00000
title: Mulliken charges with hydrogens summed into heavy atoms:
elementType: O C C C C C C C
charge: -0.213153 -0.071414 -0.020555 0.556723 0.237259 -0.145189 -0.039774 -0.303898
polarizability: 9.43755792e+01 -4.41946313e+00 7.20309793e+01 6.68682749e+00 -2.42193738e+00 6.77387109e+01
1716.lowfreq: -3.4735 0.0009 0.0010 0.0010 8.5398 12.6601 27.7644 56.4005 69.4387
frequency: 27.3316 56.0368 69.4256 92.3760 130.4527 177.5272 234.7160 349.7424 382.0776 437.7304 466.7944 518.1331 571.0853 700.3996 739.7792 804.2621 845.8766 908.7177 942.7630 945.4003 983.5758 991.6493 1040.7189 1062.1033 1068.2449 1154.0281 1170.3908 1261.5291 1281.9577 1299.8931 1344.1861 1367.8761 1393.1431 1429.2517 1429.3369 1443.0181 1455.3829 1459.9037 1469.3880 1478.2164 1635.5757 1670.0031 2962.4515 2965.1110 2980.6371 2990.4162 3014.1889 3035.2449 3060.2890 3066.5054 3086.2838 3087.7247 3119.6560 3190.5983
redmass: 3.3805 2.4093 1.2890 1.5323 3.4548 1.1428 4.3765 2.7864 2.1538 2.1993 2.0803 2.6095 4.0151 1.0882 1.3002 3.9078 2.5390 1.4114 1.3251 1.8943 1.5795 1.3885 1.5686 2.8056 1.9052 1.3809 1.9112 1.3130 1.5816 2.1896 1.6959 1.2385 1.2412 1.0842 1.1730 1.0657 1.0577 1.0762 1.0612 1.0719 7.7011 5.0041 1.0484 1.0498 1.0383 1.0630 1.0945 1.0964 1.1003 1.0954 1.0960 1.0645 1.1004 1.1140
irintensity: 4.0210 0.8265 0.0820 0.1903 4.2926 1.1251 2.9504 0.2398 0.8396 5.2434 2.2655 12.2593 6.6700 1.4090 2.9001 0.4956 1.1389 3.6123 81.2142 4.6713 0.3109 5.7160 4.4160 2.0557 1.7240 8.6179 39.4750 27.2868 54.2376 16.0956 26.1588 59.2813 23.3447 19.6759 1.2328 19.6542 18.8574 11.0972 28.2960 13.8258 111.0692 29.5358 10.2064 34.4248 5.8726 12.6055 10.7348 28.8491 24.1794 20.0387 35.3701 3.5964 14.6287 26.7613
temp: 298.150 k
press: 1.00000 atm
elementType: 8 6 6 6 6 6 6 6 1 1 1 1 1 1 1 1 1 1 1 1
symmnumber: 1
zpe: 447697.1 jmol-1
zpe.correction: 0.170519 hartree
zpe.thermalcorrener: 0.180796 hartree
zpe.thermalcorrenthalpy: 0.181740 hartree
zpe.thermalcorrgfe: 0.133473 hartree
zpe.sumelectzpe: -348.504511 hartree
zpe.sumelectthermal: -348.494234 hartree
zpe.sumelectthermalent: -348.493290 hartree
zpe.sumelectthermalfe: -348.541557 hartree
dipole: 0.2901 2.4443 1.8458
dipole: 3.0767
quadrupole: -50.7501 -50.3959 -51.4301
quadrupole: -3.4280 -5.4560 -3.2883
quadrupole: 0.1086 0.4628 -0.5714 -3.4280 -5.4560 -3.2883
hfenergy: -348.6750299 hartree
pointgroup: C01 [X(C7H12O1)]
dipole: -0.119279 1.0223073 -0.6370627 debye
dipolederiv: -0.6711228 0.0445711 -0.0496488 0.0763279 -0.6120465 0.2913126 -0.0583158 0.2771473 -0.5364697 -0.0693982 0.0192787 0.0071775 0.0130989 0.0412665 -0.032913 -0.0516596 0.0028718 0.1018297 -0.4871541 0.0863885 -0.0713414 0.2743312 -0.009782 0.1354446 -0.1138643 0.0917545 0.0896128 0.3434641 -0.0481451 0.0926351 -0.1158909 0.1670219 0.1981576 0.1549581 0.1976491 0.0987735 1.2183361 -0.0031286 -0.0453565 -0.0999396 0.58327 -0.4754309 -0.0168465 -0.4525219 0.4907698 -0.0372728 0.0419156 -0.005806 0.1076349 -0.0811405 -0.0916289 0.0001869 -0.0981928 0.0190815 -0.3797758 -0.1799739 0.1778059 -0.1377538 -0.0655295 0.1235996 0.2215308 0.1632046 -0.1504697 -0.1876688 -0.1888302 0.0336565 -0.1677435 -0.1990268 0.1134307 -0.0029949 0.1077719 -0.361347 0.0647317 -0.0029093 -0.0331496 -0.0110873 0.0871256 0.0122224 -0.008303 0.0296288 -0.1123466 0.0302887 0.0171991 0.0097125 0.0281951 -0.0957892 -0.0710348 0.0379731 -0.1011276 0.033352 0.0997891 0.013849 -0.0075357 -0.0271864 -0.084479 -0.0592329 0.0024587 -0.0818507 0.0582459 0.0570715 0.0020824 0.0081718 -0.0615015 0.0838569 0.0272889 0.0395137 0.0594342 -0.1083941 -0.1569447 0.0943341 -0.0124824 0.0277995 0.075933 -0.0157526 -0.0634983 0.0020209 0.0892031 0.1095948 0.0289756 -0.0477192 -0.0007996 0.0651935 0.0312534 -0.0272229 -0.0204077 -0.1571107 0.0203596 -0.136459 0.0469113 -0.1339618 -0.0892026 -0.0037749 0.0396636 0.0435499 0.068067 0.0993689 -0.0319028 -0.011881 -0.0076451 0.08117 -0.0767207 0.0144786 -0.0579883 -0.0579382 0.0777353 0.0787256 0.0198972 0.0332906 -0.1066809 0.0227918 -0.0119377 -0.0090561 0.1231143 -0.0900816 -0.0066627 -0.0592683 0.0199574 0.0945942 0.039944 -0.0943963 0.0171456 0.0730048 0.0692844 0.096857 0.0118459 0.0726005 -0.0275569 -0.1341582 -0.001044 -0.1209377 0.0978923 -0.1106053 0.0738348 -0.0636249 0.1102733 0.0918022 -0.0347987 -0.0606801 -0.0500958 0.1411294 unknown
polarizability: 94.3418719|3.9141198|71.6017001|7.0352199|2.7994633|68.2016974 unknown
InChI: InChI=1S/C7H12O/c1-6(2)4-5-7(3)8/h1,4-5H2,2-3H3
charge 0 multiplicity 1
20 atoms
O  2.197551 -0.936253 0.898414
C  -0.556496 -0.538878 0.262423
C  0.527439 0.45041 -0.228195
C  -1.976136 -0.055557 -0.006308
C  1.956773 0.006434 0.098269
C  -2.4293 1.18788 0.741902
C  3.079192 0.763821 -0.605514
C  -2.802741 -0.718104 -0.859461
H  -0.404966 -0.702463 1.347726
H  -0.389959 -1.517544 -0.222964
H  0.386817 1.449476 0.236869
H  0.441591 0.620627 -1.320507
H  -3.48943 1.418299 0.541747
H  -2.303874 1.055577 1.834626
H  -1.83259 2.077366 0.458336
H  3.168479 0.397923 -1.647425
H  2.866722 1.84697 -0.65961
H  4.038534 0.590852 -0.093139
H  -2.475882 -1.621095 -1.3890
H  -3.828925 -0.380842 -1.047591
