program: Gaussian 09
title: 000228599
version: EM64L-G09RevD.01
frameworkgroup: C1[X(C7F7I)]
method: RPBEPBE
basis: SDD
operation: Freq
keyword: #p
keyword: freq=noraman
keyword: PBEPBE/SDD
title: #p freq=noraman PBEPBE/SDD
converged: NO NO NO NO
title: Mulliken charges:
elementType: I F F F F F F F C C C C C C C
charge: 0.287171 -0.128172 -0.133307 -0.145762 -0.145760 -0.144638 -0.137802 -0.131422 0.279939 -0.690244 0.077288 0.281564 0.499036 0.113460 0.118650
chargesum: 0.00000
title: Mulliken charges with hydrogens summed into heavy atoms:
polarizability: 1.52694813e+02 -3.95395159e+00 1.05963368e+02 -2.07159224e-03 8.45898791e-04 4.18312078e+01
1716.lowfreq: -5.7917 -0.0005 0.0004 0.0008 2.3668 6.0584 34.4744 50.8500 91.4660
frequency: 34.3731 50.8317 91.4657 124.1235 146.9044 158.9152 174.9067 210.3875 259.5135 266.5545 273.7253 281.9997 305.2320 347.1695 348.3102 402.6563 450.3353 472.5357 496.0139 498.4134 625.8736 628.3067 660.3099 700.2384 749.9324 779.3890 811.6706 962.5323 996.8672 1029.4523 1055.2744 1140.0935 1215.3952 1316.6533 1359.9690 1421.2457 1455.4167 1590.0444 1598.5495
redmass: 18.6069 20.9179 18.3078 25.9436 18.6740 15.8388 24.5528 20.7603 18.8467 14.7850 18.4668 18.7914 17.4687 17.1982 12.8654 14.3783 16.3115 17.7661 15.4068 16.4558 16.9302 12.2236 12.5666 12.9724 13.9169 12.1019 14.3488 13.7167 13.0133 13.4530 13.0956 12.8858 12.5857 12.2185 12.0730 12.2605 12.3215 12.0323 12.0167
irintensity: 0.0123 0.5876 0.0027 0.8797 0.1158 1.2482 0.6532 0.6022 0.1956 0.8700 0.1311 0.2138 0.2297 2.9382 1.5682 0.0322 1.0428 1.8398 3.2454 1.9571 31.1487 2.1578 0.1328 0.6841 85.6415 3.1201 70.9267 65.4325 244.3835 58.0410 31.1231 192.0980 52.1364 195.5689 55.8289 283.1435 118.4067 2.4869 46.7098
temp: 298.150 k
press: 1.00000 atm
elementType: 53 9 9 9 9 9 9 9 6 6 6 6 6 6 6
symmnumber: 1
zpe: 152473.5 jmol-1
zpe.correction: 0.058074 hartree
zpe.thermalcorrener: 0.071719 hartree
zpe.thermalcorrenthalpy: 0.072664 hartree
zpe.thermalcorrgfe: 0.015533 hartree
zpe.sumelectzpe: -976.012625 hartree
zpe.sumelectthermal: -975.998980 hartree
zpe.sumelectthermalent: -975.998035 hartree
zpe.sumelectthermalfe: -976.055166 hartree
dipole: 0.9298 -1.3343 0.0000
dipole: 1.6263
quadrupole: -97.2996 -107.4599 -94.6859
quadrupole: -2.1060 0.0004 -0.0002
quadrupole: 2.5156 -7.6448 5.1292 -2.1060 0.0004 -0.0002
hfenergy: -976.070699 hartree
pointgroup: C01 [X(C7F7I1)]
dipole: 0.2289444 0.5974897 0.0001089 debye
dipolederiv: 0.1091873 0.1808571 -0.0000432 0.1753511 -0.1764363 0.0001465 -0.0000419 0.0001568 0.1606843 -0.2552651 -0.2778491 -0.0000855 -0.2031978 -0.895113 -0.0000441 -0.000087 -0.0001215 -0.0880081 -0.4602265 -0.2712077 -0.0001497 -0.1806571 -0.6484016 -0.0001871 -0.000142 -0.0002536 -0.2671813 -0.5797021 0.0066422 0.1942567 0.082578 -0.3344756 -0.1773994 0.1792344 -0.1293817 -0.6204643 -0.5790962 0.0064932 -0.1941555 0.0823134 -0.3345664 0.1775051 -0.1791321 0.1294485 -0.6209849 -0.4092989 -0.2926763 -0.0001978 -0.418459 -0.6000041 -0.0002611 -0.0001899 -0.0001868 -0.0987174 -0.4291768 0.4283834 -0.0003274 0.4265879 -0.7923514 0.0004102 -0.0003174 0.0004054 -0.0782474 -1.05982 0.0678984 -0.0007555 -0.0140917 -0.1718666 0.0000044 -0.0007543 0.000048 -0.0790924 -0.495803 0.118498 -0.0003205 -0.0678574 -0.372028 -0.0000426 -0.0004015 0.0002537 -0.0844598 0.0946052 -0.5930911 0.0003031 -0.2417434 0.6595706 -0.000209 0.0002716 -0.0005478 -0.2177993 0.3623475 0.5006512 0.0001189 0.1402051 0.9452097 -0.0000068 0.0001771 0.0002692 0.094407 1.9343278 0.3135678 0.0002483 0.0619672 1.3259514 0.0001258 0.000274 0.0002073 1.5570435 0.2133025 0.5541339 -0.0000319 0.7921415 0.3812825 0.0005587 0.000009 0.0002873 0.1582976 0.3302153 -0.710468 0.0002728 -0.5234192 0.7334272 -0.0004737 0.0002367 -0.0005947 0.0949457 1.224403 -0.0318328 0.0008672 -0.1117185 0.2798016 -0.0001268 0.0008632 0.0000098 0.0895768 unknown
polarizability: 117.0258704|-20.2539402|141.6322589|0.0611718|-0.0279199|41.8312589 unknown
InChI: InChI=1S/C7F7I/c8-2-1(7(12,13)14)6(15)5(11)4(10)3(2)9
charge 0 multiplicity 1
15 atoms
I  -1.029381 3.076623 -0.001067
F  -0.474454 -2.531923 -0.000018
F  -2.745188 -1.458827 -0.002228
F  -2.786411 0.487607 1.134819
F  -2.784626 0.487717 -1.139125
F  2.038195 2.433325 0.001308
F  2.224613 -2.367511 0.002037
F  3.511764 0.113023 0.002707
C  -0.716772 -0.082972 -0.000565
C  -0.051422 1.183663 -0.000178
C  0.075536 -1.257664 0.000217
C  -2.233922 -0.153287 -0.001755
C  1.357592 1.22298 0.000908
C  1.484099 -1.197912 0.0013
C  2.130376 0.045059 0.001641
