program: Gaussian 09
title: 000228594
version: EM64L-G09RevD.01
frameworkgroup: C1[X(C13H9ClO2)]
method: RPBEPBE
basis: SDD
operation: Freq
keyword: #p
keyword: freq=noraman
keyword: PBEPBE/SDD
title: #p freq=noraman PBEPBE/SDD
converged: YES YES NO NO
title: Mulliken charges:
elementType: Cl O O C C C C C C C C C C C C C H H H H H H H H H
charge: -0.047034 -0.240223 -0.256463 0.313288 0.107691 -0.327109 -0.341183 0.347306 -0.286338 -0.271209 -0.227145 -0.220935 -0.103143 -0.380949 -0.251719 -0.159170 0.228958 0.286196 0.238130 0.281495 0.257447 0.259615 0.266326 0.260161 0.266009
chargesum: 0.00000
title: Mulliken charges with hydrogens summed into heavy atoms:
elementType: Cl O O C C C C C C C C C C C C C
charge: -0.047034 -0.240223 -0.256463 0.313288 0.107691 -0.098151 -0.054988 0.347306 -0.048209 0.010286 0.030302 0.038680 -0.103143 -0.114623 0.008442 0.106839
polarizability: 3.59815006e+02 8.72326825e+00 1.57517235e+02 1.41830164e-01 1.96341007e-02 5.88777223e+01
1716.lowfreq: -7.2845 -4.3191 -0.0028 -0.0026 -0.0024 3.9205 20.2566 34.5315 46.8889
frequency: 20.1851 34.5025 46.8877 87.9333 98.9725 150.2336 168.4288 212.6098 251.1467 274.6817 309.4343 330.9100 381.4103 406.6772 474.5908 495.2980 520.6507 584.7069 622.4863 632.6878 661.0938 681.2693 731.5810 739.9297 744.0999 818.9460 827.1221 847.9801 852.0162 868.7806 876.0090 884.8074 891.8984 955.8533 991.2411 995.6469 997.3286 1020.4534 1027.2430 1056.9917 1072.3202 1110.3885 1134.1268 1181.1680 1188.0102 1224.4878 1257.4558 1278.5008 1294.0818 1325.0043 1368.5810 1374.4133 1396.6701 1464.5017 1475.6092 1512.2329 1543.3032 1580.8443 1593.5973 1647.0848 3121.9930 3153.3231 3155.3139 3168.2504 3174.4883 3178.9869 3221.8684 3236.6450 3267.1116
redmass: 3.8657 5.1498 7.1646 9.0222 6.3558 7.3710 3.6576 8.2581 8.1123 5.4296 8.2565 3.1484 6.2445 2.8581 3.2963 7.1422 5.1037 2.9452 7.1551 3.8878 7.9611 4.5319 6.2831 3.0104 1.2647 1.3222 1.3802 4.6392 1.4710 6.6380 4.5497 1.7012 1.5834 1.3823 1.1561 4.5560 1.3587 1.7154 2.6901 2.6294 2.7555 1.3794 1.6023 1.2987 1.3146 2.2159 2.3710 1.4802 1.9365 1.6604 3.3300 3.5156 4.0032 4.2729 2.5965 10.7659 5.4917 7.5526 6.2272 6.6196 1.0902 1.0889 1.0886 1.0910 1.0958 1.0958 1.0927 1.0978 1.1086
irintensity: 0.0064 0.7140 0.3265 4.2699 0.1664 2.0923 0.9527 2.6084 2.1271 0.3988 1.7807 4.5225 17.0627 0.0021 14.7673 22.8544 13.9989 9.6610 2.5629 6.7270 18.6470 4.4868 33.1138 8.8298 87.4747 56.3666 0.0714 13.9366 43.0026 15.9024 11.1289 0.6473 2.2747 2.2861 47.7745 97.2888 2.7540 15.5721 92.0692 17.1661 68.1693 18.7047 2.6118 28.1420 23.1794 139.5127 50.7581 90.4567 142.0921 56.0435 6.4640 58.7428 15.5386 37.3819 19.7162 200.4325 80.8479 28.7159 197.6374 309.4974 0.6435 3.9158 0.4746 2.4870 11.3164 4.4956 3.6830 1.0521 0.0029
temp: 298.150 k
press: 1.00000 atm
elementType: 17 8 8 6 6 6 6 6 6 6 6 6 6 6 6 6 1 1 1 1 1 1 1 1 1
symmnumber: 1
zpe: 474170.3 jmol-1
zpe.correction: 0.180602 hartree
zpe.thermalcorrener: 0.194362 hartree
zpe.thermalcorrenthalpy: 0.195307 hartree
zpe.thermalcorrgfe: 0.137127 hartree
zpe.sumelectzpe: -1110.148237 hartree
zpe.sumelectthermal: -1110.134476 hartree
zpe.sumelectthermalent: -1110.133532 hartree
zpe.sumelectthermalfe: -1110.191712 hartree
dipole: -4.0246 -2.3810 0.0012
dipole: 4.6762
quadrupole: -78.6869 -96.0071 -104.3594
quadrupole: 6.5893 0.0442 0.0250
quadrupole: 14.3309 -2.9893 -11.3415 6.5893 0.0442 0.0250
hfenergy: -1110.3288387 hartree
pointgroup: C01 [X(C13H9Cl1O2)]
dipole: -1.6230263 0.8619128 0.0870848 debye
dipolederiv: -0.9904356 -0.2786814 -0.0268407 -0.3731209 -0.2388491 -0.0173543 -0.0364761 -0.017446 -0.066504 -0.3644833 -0.2296528 -0.0210327 -0.2989674 -0.3674281 -0.0221918 -0.027459 -0.0224284 -0.1272176 -0.9497746 -0.078538 -0.0074661 0.3486942 -0.9750646 -0.062823 0.0320056 -0.0622902 -0.3426115 -0.8993699 -0.2268621 -0.0215212 -0.2810888 -0.1798297 -0.0168196 -0.0279434 -0.0174279 -0.0079227 2.7699204 0.1044711 0.008364 -0.5027184 0.9514385 0.0766292 -0.0474421 0.0765291 0.1773008 0.1296689 -0.0173749 -0.0028487 0.3086237 0.0906287 0.02175 0.0293913 0.0219877 -0.1179418 0.2832011 0.1463008 0.0143758 -0.1908077 0.0390372 0.0153731 -0.0191084 0.0142347 -0.1006367 -0.68403 0.2895362 0.0287486 0.2320742 0.2029156 0.0153348 0.0233141 0.0154329 0.0355413 -1.9051732 0.3135251 0.0323194 0.022762 -0.0197887 0.0167897 0.0051973 0.0167452 -0.2063486 1.3328627 -0.2239821 -0.0239451 -0.058283 0.1230878 0.016775 -0.0077333 0.0168769 -0.0511951 -0.5985144 -0.069825 -0.0059266 0.0245252 0.0238032 0.0145896 0.0047013 0.0146853 -0.1127202 -0.3373078 -0.2462307 -0.0253961 -0.4276589 -0.1836794 -0.0065553 -0.0443 -0.0067828 -0.1120105 1.3516749 0.4096727 0.0390406 0.5469497 0.3715051 0.0434033 0.0531993 0.0435969 -0.0504373 0.4325641 -0.1746662 -0.0177654 -0.1777056 0.0942531 0.0263398 -0.0189053 0.0265121 -0.1771154 0.0775641 -0.0513364 -0.0055907 0.4850618 -0.2628026 -0.0062635 0.0454773 -0.0053499 -0.205623 -0.2679792 0.2460834 0.0231854 0.1731129 0.1567932 0.0244042 0.0168064 0.0241875 -0.1027777 -0.0081639 0.0874387 0.0099084 0.1267115 0.036713 -0.0118531 0.0135341 -0.0116752 0.1448223 0.1739118 -0.042039 -0.0043977 0.0196038 0.015183 -0.0149007 0.0012085 -0.0143217 0.1534031 0.1110093 -0.0154086 -0.0012644 0.0135008 -0.0575759 -0.0213628 0.001386 -0.0213897 0.1696969 0.114005 0.0036844 0.0005421 -0.0217106 0.0117927 -0.0136078 -0.0017548 -0.013883 0.1567044 0.0713157 -0.0244181 -0.0022906 -0.0425089 -0.0386268 -0.0215929 -0.0041096 -0.0215731 0.164974 -0.0302795 0.0654299 0.0074565 0.0578099 0.056884 -0.0115783 0.0065554 -0.0116666 0.1640391 0.1425536 -0.006955 -0.0004588 -0.0170603 -0.0057373 -0.0193756 -0.0015175 -0.0194223 0.1974889 -0.0487006 0.0214218 0.0026621 0.0240095 0.1306421 -0.0068707 0.0029553 -0.0068978 0.2019675 0.0939605 -0.0015941 0.0001419 0.0081914 0.0247049 -0.0182393 0.0010177 -0.0182338 0.2151237 unknown
polarizability: 360.1897722|0.2276489|156.1693437|-0.4003471|9.7275844|59.8508472 unknown
InChI: InChI=1S/C13H9ClO2/c14-11-5-3-10(4-6-11)13(15)8-7-12-2-1-9-16-12/h1-9H
charge 0 multiplicity 1
25 atoms
Cl 5.986098 1.362423 0.120176
O  -3.38357 1.231747 0.10931
O  0.288761 -2.374588 -0.24437
C  1.714884 -0.44149 -0.056794
C  0.363579 -1.103945 -0.120789
C  1.903429 0.959846 0.089951
C  2.861843 -1.277463 -0.147711
C  -3.362141 -0.184274 -0.025081
C  -0.85858 -0.272334 -0.039425
C  -2.09894 -0.861699 -0.092005
C  3.199814 1.515054 0.144775
C  4.161791 -0.741264 -0.095452
C  4.310266 0.653909 0.05088
C  -4.682212 -0.646759 -0.065396
C  -5.550447 0.495781 0.045172
C  -4.730777 1.612041 0.148748
H  1.04962 1.639281 0.164626
H  2.701813 -2.354693 -0.25934
H  -0.783052 0.813674 0.061627
H  -2.136281 -1.95464 -0.194643
H  3.343479 2.593313 0.257936
H  5.041323 -1.387297 -0.166043
H  -4.981493 -1.68879 -0.163314
H  -6.638281 0.495338 0.048023
H  -4.917125 2.677831 0.250239
