program: Gaussian 09
title: 000228590
version: EM64L-G09RevD.01
frameworkgroup: C1[X(C9H8N4O5)]
method: RPBEPBE
basis: SDD
operation: Freq
keyword: #pfreq=noraman
keyword: PBEPBE/SDD
title: #p freq=noraman PBEPBE/SDD
converged: NO YES NO NO
title: Mulliken charges:
elementType: O O O O O N N N N C C C C C C C C C H H H H H H H H
charge: -0.220417 -0.189644 -0.223987 -0.210921 -0.195095 -0.196755 -0.411530 -0.041745 0.050727 -0.440559 0.096497 0.180226 0.282104 0.288308 -0.307809 -0.740056 0.274062 -0.305182 0.277880 0.283487 0.361299 0.289910 0.300494 0.234699 0.268417 0.295591
chargesum: 0.00000
title: Mulliken charges with hydrogens summed into heavy atoms:
elementType: O O O O O N N N N C C C C C C C C C
charge: -0.220417 -0.189644 -0.223987 -0.210921 -0.195095 -0.196755 -0.050232 -0.041745 0.050727 0.120808 0.096497 0.180226 0.282104 0.288308 -0.017899 0.063554 0.274062 -0.009592
polarizability: 3.30725993e+02 -5.58685306e+00 1.36426106e+02 -1.80666960e+00 -3.75007516e+00 7.91733105e+01
1716.lowfreq: -9.1915 -3.1654 -2.7107 -0.0006 -0.0003 0.0004 29.6588 41.3986 49.6997
frequency: 29.6462 41.3584 49.6572 73.8097 100.9771 138.3702 146.1046 162.5807 176.6002 189.6587 214.6250 236.8239 267.9024 308.3437 345.4403 373.6319 438.8274 447.4701 509.7901 521.1016 531.6650 564.6057 567.0907 604.1991 649.8704 655.3130 663.9134 682.8050 697.4595 734.2510 750.9524 779.6274 829.7422 877.9243 900.9466 914.0671 921.3450 985.8905 993.1304 1018.2009 1043.0196 1083.9173 1104.4633 1140.9054 1150.0887 1172.8527 1188.0026 1206.1755 1250.5647 1266.9415 1303.5106 1309.8018 1329.9583 1345.8350 1369.7783 1400.6825 1443.6824 1451.9564 1458.0679 1494.8600 1532.5032 1563.2329 1679.9665 1707.0845 2999.3787 3019.0679 3083.5501 3085.4910 3119.6633 3245.6989 3262.5603 3577.3020
redmass: 8.3678 8.2111 7.0780 8.0401 6.3043 5.2578 5.3307 4.0456 3.7908 1.4734 5.3167 4.9157 6.4361 3.4451 9.6816 10.3483 9.2820 5.0183 4.5654 4.9953 2.2875 5.3528 5.2138 9.1031 2.9635 2.5246 4.5867 8.2108 3.6678 11.4437 4.4220 5.6485 1.3144 3.9368 6.8842 1.3878 6.4078 2.0312 2.1120 1.2449 1.5602 2.6726 4.6093 6.4895 1.3780 4.1111 2.7211 2.6826 6.3347 5.9166 2.3666 2.7691 1.9566 9.5216 4.6296 1.2099 1.2624 1.0780 1.1345 3.7890 6.1362 7.3976 7.9197 11.9805 1.0365 1.0601 1.1034 1.0971 1.1002 1.0946 1.1049 1.0803
irintensity: 3.1768 0.2818 2.2544 0.6255 1.1066 4.1714 9.2523 10.5103 3.7557 4.2150 2.9905 0.3211 2.1729 5.5504 1.7331 12.8216 6.0675 7.2285 15.5640 5.5917 9.6051 0.9167 4.2429 25.8027 33.7323 33.9139 4.7131 7.6598 89.9053 42.0148 32.9256 25.2356 60.0931 17.1750 13.0522 0.7877 3.0192 2.4104 5.5581 39.2600 1.0524 17.6997 114.3037 50.2390 224.8150 227.6751 157.9483 109.0792 582.9839 131.1498 31.9914 151.9859 95.1916 82.4381 45.9747 54.3945 21.0634 44.7559 29.7069 125.0527 7.2905 2.3844 506.9241 381.6089 4.3635 17.4246 2.5192 5.2106 2.8515 0.2058 5.5056 100.0636
temp: 298.150 k
press: 1.00000 atm
elementType: 8 8 8 8 8 7 7 7 7 6 6 6 6 6 6 6 6 6 1 1 1 1 1 1 1 1
symmnumber: 1
zpe: 463470.9 jmol-1
zpe.correction: 0.176527 hartree
zpe.thermalcorrener: 0.192454 hartree
zpe.thermalcorrenthalpy: 0.193398 hartree
zpe.thermalcorrgfe: 0.131505 hartree
zpe.sumelectzpe: -941.462657 hartree
zpe.sumelectthermal: -941.446730 hartree
zpe.sumelectthermalent: -941.445785 hartree
zpe.sumelectthermalfe: -941.507679 hartree
dipole: 3.9656 -2.3664 -0.0869
dipole: 4.6188
quadrupole: -146.9207 -100.4088 -101.8430
quadrupole: 15.0222 -1.3908 -3.3650
quadrupole: -30.5299 15.9821 14.5478 15.0222 -1.3908 -3.3650
hfenergy: -941.6391833 hartree
pointgroup: C01 [X(C9H8N4O5)]
dipole: 1.5269374 0.522763 -0.8350533 debye
dipolederiv: 0.0361942 0.0080989 -0.0360022 -0.0370197 -0.0944653 0.1097057 0.0458563 0.0984502 -0.5229905 -1.4435147 -0.2757828 0.2182126 -0.3441592 -0.5159599 0.1129756 0.2414894 0.1075438 -0.4075235 -0.5162204 -0.2782127 0.1375196 0.3339209 -1.0191652 0.2480152 -0.1175603 0.245197 -0.417802 -1.2073095 0.0509972 -0.0882915 0.1013808 -0.2527526 0.0581141 -0.3114176 0.0652077 -0.4751509 -0.5484198 -0.0102439 0.0810667 -0.108383 -0.2425227 0.1315781 0.5023044 0.1119663 -0.7823212 -1.6865465 0.1755832 0.1080406 1.0901379 -0.6946737 0.1026516 -0.8438624 0.1151748 -0.1718362 -1.6548669 -0.2563152 0.2189095 -0.6675296 -0.7892907 0.2603032 0.4445354 0.2331276 -0.4974193 0.9549726 -0.1089207 -0.0668689 0.026099 -0.248355 0.0582997 0.3527652 0.0877198 -0.2806401 2.4314665 -0.0065753 -0.2576334 0.1070881 0.254707 -0.2284967 -0.7193184 -0.2021937 1.1873929 0.0227425 0.2961605 -0.1478002 0.4337249 0.1973805 -0.0001187 -0.4259431 0.080159 0.2641963 0.0042492 0.0211367 0.1609947 -0.3881183 0.1208797 -0.1324438 0.2694604 -0.1099697 0.4525343 1.6856465 0.2807374 -0.2405255 0.8804579 1.0349014 -0.4770945 -0.5088837 -0.4380553 0.4789463 2.1764809 0.2266698 -0.2794176 -1.2124596 1.5098426 -0.3255543 0.5601698 -0.4353974 0.3809213 0.4169919 -0.0282334 -0.0396794 0.0069088 0.0400192 -0.016447 0.3474434 -0.0465381 0.1107284 -0.4719125 0.0134141 -0.0259248 0.1220988 -0.1440166 -0.0367795 -0.4757885 -0.0105583 0.005272 -0.0695946 0.0000126 -0.0365717 -0.0590307 -0.0110863 0.1757185 -0.0421563 0.1124452 -0.2457047 -1.175643 -0.0190659 0.3021165 -0.156181 0.0842664 0.0145153 0.7656328 -0.0032324 0.0025787 0.4473343 -0.0097504 -0.0398345 0.0669828 -0.1055725 -0.0418495 -0.2770012 -0.0386996 0.0708258 0.0255052 -0.0133092 0.0242166 -0.0837071 -0.023458 -0.0229243 0.0371311 -0.0639802 0.0739547 0.0869617 -0.0206222 -0.0325712 -0.0205665 0.0949892 -0.0049235 0.0301385 0.0390313 -0.032945 0.2002082 -0.0442919 0.0358639 -0.1034282 0.2358305 0.0718282 0.0285427 0.0617627 0.3362945 0.0771158 -0.0091169 0.0617325 -0.0086292 0.1799461 0.0206656 0.0506655 0.0164773 0.0967065 0.138713 0.0345814 -0.0266203 0.0091993 0.0214137 -0.0040297 0.0304721 -0.0405239 0.1063856 -0.0215409 -0.0813846 -0.0868462 -0.0519324 0.0522925 -0.0428956 -0.0336382 0.005082 0.0659782 0.0092394 0.0424317 0.0968694 0.0536946 0.1230347 -0.0488978 0.0613394 -0.0078889 0.0780452 0.081747 0.0120017 -0.0409553 0.0094506 0.191815 0.018084 -0.0123765 0.0176927 0.1235727 unknown
polarizability: 329.6858552|-1.8003089|93.9832087|-15.8870112|-25.2566397|122.6563453 unknown
InChI: InChI=1S/C9H8N4O5/c1-5(6-2-3-8(18-6)13(16)17)11-12-4-7(14)10-9(12)15/h2-3,10H,4H2,1H3
charge 0 multiplicity 1
26 atoms
O  -2.367498 -0.144846 0.584859
O  5.834504 0.649961 -0.877594
O  2.389961 -2.194776 0.631753
O  -5.835125 0.130786 -0.265622
O  -4.814341 -0.370485 1.73678
N  2.352732 0.051619 -0.232825
N  4.350941 -0.964022 0.0378
N  1.015533 0.235255 -0.609537
N  -4.789644 -0.06929 0.480109
C  3.345369 0.935084 -0.880276
C  0.058615 -0.106534 0.253647
C  4.687247 0.239857 -0.599031
C  2.949118 -1.155624 0.217361
C  -1.284233 0.051691 -0.299023
C  -1.775721 0.370439 -1.57427
C  0.221005 -0.543594 1.688971
C  -3.519861 0.06606 -0.174363
C  -3.202748 0.383081 -1.493721
H  3.333082 1.950204 -0.449745
H  3.157431 1.010378 -1.966744
H  5.026711 -1.673918 0.324751
H  -1.157748 0.559968 -2.447715
H  0.381866 -1.633565 1.752914
H  1.112045 -0.061235 2.129274
H  -0.673028 -0.281568 2.275319
H  -3.920012 0.589975 -2.283371
