program: Gaussian 09
title: 000228575
version: EM64L-G09RevD.01
frameworkgroup: C1[X(C10H16N2O4)]
method: RPBEPBE
basis: SDD
operation: Freq
keyword: #p
keyword: freq=noraman
keyword: PBEPBE/SDD
title: #p freq=noraman PBEPBE/SDD
converged: YES YES NO NO
title: Mulliken charges:
elementType: O O O O N N C C C C C C C C C C H H H H H H H H H H H H H H H H
charge: -0.268076 -0.268076 -0.257517 -0.257517 -0.105718 -0.105718 -0.400387 -0.393516 -0.393517 -0.400385 0.216060 0.216064 -0.372402 -0.372393 -0.309219 -0.309229 0.244937 0.245387 0.249520 0.247318 0.247318 0.249521 0.245384 0.244938 0.241845 0.199771 0.199773 0.241829 0.222747 0.239252 0.239259 0.222747
chargesum: 0.00000
title: Mulliken charges with hydrogens summed into heavy atoms:
elementType: O O O O N N C C C C C C C C C C
charge: -0.268076 -0.268076 -0.257517 -0.257517 -0.105718 -0.105718 0.089937 0.103322 0.103322 0.089937 0.216060 0.216064 0.069214 0.069209 0.152780 0.152777
polarizability: 1.88686560e+02 -2.31096376e-03 1.23655630e+02 -1.60571713e+01 -2.41226727e-03 9.75505039e+01
1716.lowfreq: -0.0004 0.0005 0.0008 2.7335 4.2713 16.0375 16.5496 28.2278 29.6015
frequency: 16.0263 28.0884 29.6000 46.1839 50.0986 93.7852 101.9752 103.9666 112.3004 144.3259 164.2402 185.8859 186.8165 206.4861 247.7407 306.4842 322.3723 348.8294 402.4277 510.6351 528.6092 550.3319 572.1063 687.7373 688.5771 728.0101 731.6011 762.6540 795.5647 796.5060 811.5174 870.1632 878.7789 930.9281 936.1442 943.1534 974.5145 992.6054 1004.3420 1006.7150 1044.5668 1047.8177 1091.4097 1100.2518 1100.9611 1109.3491 1111.4106 1120.0633 1121.1246 1123.5773 1130.6350 1142.6457 1144.3058 1155.7563 1203.7195 1255.2822 1277.0671 1293.8989 1302.4466 1335.5406 1361.1743 1365.9474 1394.7399 1396.6975 1451.8411 1456.0275 1466.2151 1466.2191 1472.1939 1483.8666 1485.3213 1485.9031 1636.8157 1639.1895 2985.5829 2991.8664 3020.8732 3022.2446 3038.0384 3059.1449 3079.0950 3079.1076 3086.9838 3087.0443 3098.2338 3102.6472 3182.2739 3182.2782 3198.0749 3198.0973
redmass: 4.8091 4.5964 5.7898 4.9260 4.3993 2.9045 3.4378 3.0909 2.1449 4.2323 3.1987 2.7923 4.0365 4.7951 3.6724 3.5711 4.4132 3.9075 4.6920 5.4696 5.6639 6.0789 4.6916 10.7785 10.4469 3.3494 3.3719 1.1955 1.0400 1.0508 1.3859 5.4332 5.0486 2.2923 5.0267 1.9100 4.4294 2.8779 1.1388 1.3180 3.8214 4.1736 3.0079 1.3680 1.3231 1.6279 1.4492 1.5047 1.4666 2.2643 2.5462 1.5948 1.8439 1.8514 1.2966 1.2335 1.1970 1.0541 1.1179 1.3255 1.8602 1.8064 2.5862 2.1323 1.1062 1.1141 1.0753 1.0754 1.0758 1.1371 1.2490 1.2023 10.2924 10.2797 1.0598 1.0600 1.0579 1.0573 1.0996 1.1038 1.0484 1.0484 1.0606 1.0606 1.1092 1.1085 1.1188 1.1188 1.1177 1.1177
irintensity: 1.2840 4.2897 0.6939 0.0961 3.5091 1.4002 3.7862 2.0814 2.8504 16.7101 0.2637 2.2439 0.0640 24.4310 1.9022 24.2801 12.2714 0.0082 17.3693 1.2343 7.7343 0.5018 1.2802 0.1253 46.5727 21.0737 12.2814 3.2569 34.9562 0.3257 2.8054 30.2760 7.3293 7.0368 8.5706 11.2646 77.2254 9.3840 9.9835 4.6658 2.1530 84.4186 6.0816 121.4272 1.0026 181.3995 0.1846 122.3646 16.6072 423.0009 85.9627 75.7707 12.1927 3.9437 4.7825 16.0896 16.9897 2.5968 0.2817 6.6949 287.9054 23.2297 31.5458 267.8401 81.4328 0.7312 0.2175 8.7669 0.3318 13.3084 0.0446 48.1421 416.1660 337.1331 5.0294 21.7941 2.7682 90.2937 0.7441 12.9208 3.1804 33.9921 68.2424 2.1571 1.2174 47.2236 0.6363 1.0933 58.6438 0.6656
temp: 298.150 k
press: 1.00000 atm
elementType: 8 8 8 8 7 7 6 6 6 6 6 6 6 6 6 6 1 1 1 1 1 1 1 1 1 1 1 1 1 1 1 1
symmnumber: 1
zpe: 675796.8 jmol-1
zpe.correction: 0.257397 hartree
zpe.thermalcorrener: 0.274896 hartree
zpe.thermalcorrenthalpy: 0.275840 hartree
zpe.thermalcorrgfe: 0.207865 hartree
zpe.sumelectzpe: -799.714809 hartree
zpe.sumelectthermal: -799.697310 hartree
zpe.sumelectthermalent: -799.696366 hartree
zpe.sumelectthermalfe: -799.764341 hartree
dipole: 0.0002 -3.9020 0.0006
dipole: 3.9020
quadrupole: -65.3095 -102.7057 -92.1011
quadrupole: -0.0032 -21.1134 0.0020
quadrupole: 21.3960 -16.0003 -5.3957 -0.0032 -21.1134 0.0020
hfenergy: -799.9722061 hartree
pointgroup: C01 [X(C10H16N2O4)]
dipole: 0.0009453 0.0000416 1.5351651 debye
polarizability: 189.5081383|-13.5010988|96.728898|-0.0426902|0.0115324|123.6556577 unknown
InChI: InChI=1S/C10H16N2O4/c13-9(11-3-4-11)15-7-1-2-8-16-10(14)12-5-6-12/h1-8H2
charge 0 multiplicity 1
32 atoms
O  3.044724 0.825492 0.60175
O  -3.043727 -0.825278 0.605761
O  3.167343 0.62611 -1.745471
O  -3.169611 -0.626128 -1.741303
N  5.075518 0.446281 -0.375451
N  -5.075882 -0.446254 -0.368645
C  5.768103 -0.457022 0.567957
C  5.975033 -0.569958 -0.954947
C  -5.976383 0.569714 -0.947072
C  -5.767282 0.457118 0.575562
C  3.715422 0.60505 -0.614921
C  -3.716099 -0.604862 -0.609988
C  0.75787 -0.158221 0.45195
C  -0.757073 0.158438 0.453016
C  1.592296 1.129913 0.479117
C  -1.591466 -1.129696 0.481141
H  6.544276 0.002681 1.187585
H  5.171228 -1.232216 1.062383
H  5.513652 -1.417269 -1.476246
H  6.895772 -0.188702 -1.406721
H  -6.897696 0.188209 -1.397465
H  -5.515884 1.416997 -1.469197
H  -5.169834 1.23251 1.068984
H  -6.542503 -0.002586 1.196381
H  1.021859 -0.738052 -0.45244
H  1.016748 -0.77367 1.3361
H  -1.014733 0.773762 1.337608
H  -1.022293 0.73841 -0.450926
H  1.375281 1.735947 1.374803
H  1.426847 1.726255 -0.436098
H  -1.427246 -1.725923 -0.43437
H  -1.373259 -1.735849 1.376458
