program: Gaussian 09
title: 000228578
version: EM64L-G09RevD.01
frameworkgroup: C1[X(C17H19FO2)]
method: RPBEPBE
basis: SDD
operation: Freq
keyword: #p
keyword: freq=noraman
keyword: PBEPBE/SDD
title: #p freq=noraman PBEPBE/SDD
converged: YES YES NO NO
title: Mulliken charges:
elementType: F O O C C C C C C C C C C C C C C C C C H H H H H H H H H H H H H H H H H H H
charge: -0.207139 -0.430633 -0.215343 -0.246933 0.220279 -0.433493 0.526767 -0.728677 -0.751372 0.102129 -0.657258 -0.702801 -0.388097 0.377821 0.403696 -0.456481 -0.400476 -0.560959 -0.389622 0.329900 0.244476 0.225900 0.203692 0.232775 0.222491 0.240235 0.233484 0.231000 0.238478 0.248373 0.232903 0.210863 0.216442 0.239512 0.239206 0.246115 0.378576 0.267337 0.256834
chargesum: 0.00000
title: Mulliken charges with hydrogens summed into heavy atoms:
elementType: F O O C C C C C C C C C C C C C C C C C
charge: -0.207139 -0.052057 -0.215343 -0.002457 0.220279 -0.003902 0.526767 -0.033177 -0.048410 0.102129 -0.408885 -0.042593 -0.148585 0.377821 0.403696 -0.217274 -0.154360 -0.293622 -0.132788 0.329900
polarizability: 2.86988345e+02 1.67447605e+01 1.52095148e+02 1.76114366e+00 2.74784821e+01 1.50585951e+02
1716.lowfreq: -19.3754 -9.5658 -2.2113 0.0001 0.0006 0.0007 25.7409 30.3457 47.5438
frequency: 25.6333 30.1052 47.4641 52.8089 75.6740 116.1329 132.9774 155.8675 170.3890 188.8578 211.6126 227.7104 236.9212 244.6087 266.5222 271.2774 306.6026 317.2151 334.3052 356.6014 398.1276 407.0971 422.7253 441.7485 478.3696 484.4274 493.9255 520.5684 552.1958 576.9619 600.6208 615.0253 661.5224 680.3804 722.3643 730.3918 741.5253 774.0801 785.8758 808.0289 812.5279 825.9156 858.7939 886.3011 895.6857 906.1154 931.5550 939.6150 957.7174 961.4992 967.3248 979.6556 999.3982 1028.9662 1042.4269 1073.1570 1097.1051 1117.0934 1141.6393 1158.3003 1167.4248 1171.4721 1188.6374 1194.7487 1241.5643 1250.2692 1259.8771 1271.8917 1282.2975 1304.1079 1321.9672 1335.6807 1350.3110 1381.2497 1390.8636 1402.3994 1411.1984 1415.7129 1426.6705 1463.8327 1466.7106 1469.9413 1474.1119 1476.9619 1481.7014 1484.1378 1487.2127 1515.1692 1580.7872 1610.8691 1640.9311 1646.7087 2978.1937 2984.6107 2988.3042 2995.9318 3000.4200 3034.1998 3073.7955 3080.3305 3083.7209 3095.3357 3098.9817 3103.2725 3113.5152 3124.9950 3137.1205 3151.5255 3162.1757 3176.8368 3514.0615
redmass: 4.1201 5.3509 4.5210 9.9743 2.6402 6.6536 3.8510 2.8570 3.2782 2.6131 1.2712 1.7628 3.5544 1.7014 1.5276 1.9622 5.2486 2.9632 2.9642 4.0957 3.8686 4.1630 3.4790 4.3552 2.5916 3.8006 4.7817 6.5935 3.7669 2.4590 1.4180 3.9087 3.7487 4.1975 6.0696 2.7807 3.7033 2.3471 2.7569 1.7314 1.4842 1.4548 2.6810 1.6561 2.3862 1.6886 3.0684 1.5687 1.4567 3.2788 2.0276 1.3730 1.3947 2.2729 1.8903 1.9263 2.3504 1.5731 1.7216 2.1694 1.3060 1.8563 1.7105 2.3560 2.3329 1.4394 1.8487 1.7676 2.1481 1.7247 1.4501 1.4343 1.6178 1.1938 1.2170 1.2192 3.5503 3.3296 6.9290 1.0652 1.0649 1.1097 2.2782 1.0550 1.0502 1.0680 1.0661 3.8717 7.3069 6.5097 7.1115 8.5996 1.0360 1.0612 1.0350 1.0808 1.0379 1.0991 1.0997 1.1001 1.0996 1.0990 1.1010 1.1001 1.0911 1.0874 1.0895 1.0963 1.0928 1.0961 1.0641
irintensity: 0.2423 0.2198 0.2310 0.4867 0.1083 0.0579 0.0694 0.1041 0.2457 1.2678 0.0926 0.3654 0.3984 1.0735 0.2158 0.7423 0.7358 1.6088 4.8894 1.9033 1.6226 2.3599 4.6977 10.2930 20.1728 11.2014 7.5055 1.4658 8.0795 17.5966 95.1066 15.9355 12.4037 12.4252 17.8351 5.2590 4.8281 2.6743 2.9782 0.3159 31.1545 5.6568 51.3949 69.9753 8.2912 13.4674 9.9480 7.6999 3.4144 8.7765 16.4769 4.2801 39.0516 205.4210 2.4512 11.2786 4.7075 17.6687 38.6152 12.3303 12.6912 10.9880 2.0619 8.4560 47.3154 6.7964 7.0293 5.0671 10.2662 1.8586 5.8140 1.8236 2.8969 14.0842 10.1129 32.3099 7.5213 7.8865 0.2256 6.1433 5.4795 1.8953 21.0688 13.5861 19.4369 14.3787 21.4893 29.9284 14.4539 50.2191 22.6221 240.3602 35.4654 23.1717 18.2994 15.2752 9.8615 19.9942 40.6031 55.2224 21.7344 37.9694 13.5550 28.7604 13.0904 4.8147 7.9764 17.8952 3.6189 5.2446 25.0144
temp: 298.150 k
press: 1.00000 atm
elementType: 9 8 8 6 6 6 6 6 6 6 6 6 6 6 6 6 6 6 6 6 1 1 1 1 1 1 1 1 1 1 1 1 1 1 1 1 1 1 1
symmnumber: 1
zpe: 829674.8 jmol-1
zpe.correction: 0.316006 hartree
zpe.thermalcorrener: 0.335471 hartree
zpe.thermalcorrenthalpy: 0.336415 hartree
zpe.thermalcorrgfe: 0.267594 hartree
zpe.sumelectzpe: -908.057207 hartree
zpe.sumelectthermal: -908.037743 hartree
zpe.sumelectthermalent: -908.036799 hartree
zpe.sumelectthermalfe: -908.105620 hartree
dipole: 1.0907 -0.3966 -1.3304
dipole: 1.7655
quadrupole: -140.9605 -112.7475 -114.3908
quadrupole: -1.4480 -6.8337 7.0456
quadrupole: -18.2609 9.9521 8.3088 -1.4480 -6.8337 7.0456
hfenergy: -908.3732138 hartree
pointgroup: C01 [X(C17H19F1O2)]
dipole: -0.4291789 -0.1198161 0.5328205 debye
polarizability: 286.9131387|-16.9226565|148.5125583|2.7526803|-27.3341762|154.2437465 unknown
InChI: InChI=1S/C17H19FO2/c1-4-15(17(2,3)16(19)20)13-6-5-12-10-14(18)8-7-11(12)9-13/h5-10,15,19H,4H2,1-3H3
charge 0 multiplicity 1
39 atoms
F  6.054245 -0.264067 -0.335721
O  -4.209951 -1.178209 1.30593
O  -5.201421 -0.441099 -0.649495
C  -1.891546 0.314185 0.448427
C  -2.710897 -0.629942 -0.54265
C  -2.528046 1.727976 0.577687
C  -0.400508 0.371792 0.10687
C  -2.121847 -2.072625 -0.518607
C  -2.74844 -0.110998 -1.999308
C  -4.153703 -0.714633 -0.023198
C  0.520581 -0.397057 0.830808
C  -1.917182 2.556077 1.728587
C  0.106112 1.218909 -0.940564
C  1.924934 -0.374415 0.546866
C  2.414188 0.476571 -0.519933
C  1.465933 1.269628 -1.245409
C  2.862893 -1.167862 1.28896
C  3.817779 0.50683 -0.810567
C  4.22764 -1.132665 0.997731
C  4.671129 -0.286323 -0.056376
H  -1.981635 -0.170738 1.440595
H  -3.616306 1.617352 0.751832
H  -2.427205 2.28723 -0.371906
H  -2.094477 -2.476977 0.507563
H  -2.73028 -2.751585 -1.143551
H  -1.095183 -2.062085 -0.922508
H  -3.373107 -0.773342 -2.622903
H  -3.182599 0.900647 -2.067613
H  -1.729883 -0.096584 -2.421982
H  0.163262 -1.038843 1.64658
H  -0.837319 2.728669 1.571549
H  -2.037475 2.034466 2.696758
H  -2.410214 3.541702 1.811785
H  -0.58891 1.849098 -1.505053
H  1.825577 1.925611 -2.046861
H  2.494626 -1.810906 2.096234
H  -5.163792 -1.232273 1.58544
H  4.212863 1.1412 -1.610033
H  4.957063 -1.730616 1.551236
