program: Gaussian 09
title: 000228576
version: EM64L-G09RevD.01
frameworkgroup: C1[X(C16H28N2O2)]
method: RPBEPBE
basis: SDD
operation: Freq
keyword: #p
keyword: freq=noraman
keyword: PBEPBE/SDD
title: #p freq=noraman PBEPBE/SDD
converged: YES YES NO NO
title: Mulliken charges:
elementType: O O N N C C C C C C C C C C C C C C C C H H H H H H H H H H H H H H H H H H H H H H H H H H H H
charge: -0.231844 -0.231637 -0.129038 -0.128931 -0.075568 -0.075706 -0.435523 -0.435967 0.127106 0.127159 -0.691233 -0.691284 -0.503209 -0.503844 -0.373048 -0.372200 -0.372615 -0.372595 -0.384174 -0.384218 0.243756 0.243637 0.252488 0.234719 0.252519 0.234742 0.223437 0.232155 0.218400 0.232124 0.218384 0.223460 0.218383 0.239680 0.218538 0.240274 0.235998 0.197376 0.197917 0.235513 0.189258 0.192589 0.188997 0.192374 0.199126 0.191614 0.191739 0.199173
chargesum: 0.00000
title: Mulliken charges with hydrogens summed into heavy atoms:
elementType: O O N N C C C C C C C C C C C C C C C C
charge: -0.231844 -0.231637 -0.129038 -0.128931 0.168188 0.167931 0.051684 0.051294 0.127106 0.127159 -0.017241 -0.017317 -0.045145 -0.045033 0.060326 0.061230 0.009232 0.008776 0.006566 0.006695
polarizability: 2.51481931e+02 -1.41772529e-02 1.63319421e+02 -3.55697958e+00 -4.15889564e-01 1.71122237e+02
1716.lowfreq: -6.0911 -2.8861 -0.0015 0.0007 0.0012 4.8068 10.3928 16.0568 23.7743
frequency: 6.1539 15.5158 23.7400 26.9590 46.2577 58.5974 61.2349 81.1951 85.0473 97.4666 105.8285 107.6154 115.1523 144.8622 148.1937 153.7750 162.2073 170.6344 195.2563 206.7884 215.6826 279.4126 307.6726 318.9711 319.5670 361.8562 389.1429 403.0885 443.6706 446.6617 486.8051 572.0850 572.3533 576.3002 581.5282 722.0688 725.7506 734.6110 739.0729 743.3237 782.4269 798.6379 801.4283 846.2801 889.5369 890.4644 909.7333 913.2964 921.7491 969.9490 984.1555 996.0348 1008.5309 1012.4059 1024.1604 1025.3245 1049.9959 1064.0637 1079.2351 1080.1239 1080.8989 1081.0394 1091.7694 1098.0505 1104.3853 1109.8846 1110.7562 1133.3389 1135.0394 1151.2329 1152.0341 1174.7450 1177.4873 1198.3041 1209.4754 1232.6728 1244.0002 1263.3927 1274.3579 1282.0389 1284.6278 1296.4362 1297.2630 1299.4445 1317.7729 1331.7040 1344.9477 1355.2575 1356.9589 1359.3209 1389.4709 1389.8376 1409.8682 1410.8091 1442.6132 1443.8371 1462.2284 1462.3279 1462.9538 1463.2526 1467.2379 1474.0038 1474.2159 1475.1152 1475.4769 1475.7183 1484.1920 1489.3878 1595.3621 1595.5573 2949.1457 2951.1150 2953.8085 2963.0391 2970.7071 2972.0080 2981.6989 2982.0890 2985.3472 2985.6189 2987.3637 2993.6543 3009.8971 3023.2755 3025.2796 3034.7665 3059.1061 3060.5526 3067.8735 3068.3791 3074.8408 3075.1490 3077.1047 3077.2205 3099.5112 3099.7367 3179.1774 3179.6555
redmass: 4.4028 4.7062 4.5852 3.1441 3.0820 1.9442 3.2878 3.9177 2.8836 3.2486 2.4053 2.4183 4.6394 1.9539 2.3886 2.9766 1.8836 1.5244 3.0740 1.5427 1.7355 4.2109 4.2427 3.4516 3.4967 3.2650 2.3176 2.5822 3.5038 3.4533 3.1037 3.9426 4.0178 2.9043 2.8629 1.0625 1.0975 5.0826 4.6560 1.1938 1.4455 2.4489 2.0966 1.3859 1.2200 1.2156 2.4013 3.1020 1.5817 3.7827 3.5130 1.4725 4.1002 2.4004 1.2757 1.3253 3.2427 2.6515 1.5608 1.4482 1.9607 2.0904 3.6230 1.6036 1.5210 1.4589 1.4514 1.5645 1.5392 1.9628 1.9592 2.1960 2.2657 1.5050 1.3573 1.3524 1.3579 1.2457 1.3273 1.0567 1.1261 1.1122 1.1521 1.4327 1.5531 1.6387 1.6294 1.6559 1.6876 1.6659 1.3411 1.3261 2.3004 2.3180 1.0881 1.0879 1.0704 1.0491 1.0478 1.0683 1.0768 1.0961 1.1403 1.1174 1.1119 1.1580 1.0975 1.0997 9.1522 9.1030 1.0587 1.0590 1.0594 1.0597 1.0620 1.0622 1.0721 1.0675 1.0360 1.0360 1.0858 1.0938 1.1001 1.0969 1.0980 1.1043 1.1017 1.1018 1.0854 1.0843 1.0590 1.0579 1.0990 1.0990 1.0993 1.0993 1.1175 1.1175
irintensity: 1.2359 0.7665 2.5773 0.9146 0.1052 0.5896 0.0502 0.2657 5.6914 0.2594 2.2593 1.6602 0.0830 1.6092 0.0031 0.0168 1.5289 0.0968 12.6516 3.3628 0.3366 0.7177 3.1148 13.1449 25.2069 1.2965 0.3881 5.3182 0.2256 0.0179 14.4736 4.1362 5.8107 1.0142 3.3231 15.2328 0.6319 12.7853 8.7624 1.4344 2.1010 2.4986 1.9713 0.1627 7.0568 2.0687 13.4995 13.4484 1.8923 11.2640 52.8029 0.3602 6.9681 7.6654 5.8180 3.3722 2.3615 1.4978 2.9128 1.3406 7.8014 0.4485 0.8947 12.7858 8.2169 9.4363 7.1732 12.5863 0.7457 67.8556 5.3396 94.1800 23.6952 2.5582 79.7704 0.1726 0.4242 9.9173 0.6757 3.4551 0.8995 0.1230 17.6533 20.2858 105.2288 18.5707 84.3111 0.1645 0.0684 5.9259 37.9518 26.6453 271.9668 145.9821 12.8378 12.0268 1.2734 13.4754 14.7185 0.1045 0.0767 15.7905 12.8028 18.0902 10.3398 23.3154 0.0630 31.4098 242.5045 239.1123 9.8726 0.3344 0.0008 91.9617 4.0161 2.6704 58.4679 10.1120 24.3822 23.8586 39.5931 9.2886 1.6246 21.5399 5.9070 48.5072 3.3933 148.8419 12.7084 12.4798 29.1545 26.0636 30.9192 26.4586 32.0731 35.5667 14.3537 14.2755
temp: 298.150 k
press: 1.00000 atm
elementType: 8 8 7 7 6 6 6 6 6 6 6 6 6 6 6 6 6 6 6 6 1 1 1 1 1 1 1 1 1 1 1 1 1 1 1 1 1 1 1 1 1 1 1 1 1 1 1 1
symmnumber: 1
zpe: 1087279.0 jmol-1
zpe.correction: 0.414123 hartree
zpe.thermalcorrener: 0.438433 hartree
zpe.thermalcorrenthalpy: 0.439377 hartree
zpe.thermalcorrgfe: 0.354092 hartree
zpe.sumelectzpe: -884.785751 hartree
zpe.sumelectthermal: -884.761441 hartree
zpe.sumelectthermalent: -884.760497 hartree
zpe.sumelectthermalfe: -884.845782 hartree
dipole: 0.0311 6.5219 0.2402
dipole: 6.5264
quadrupole: -99.9442 -124.4166 -130.3747
quadrupole: 0.8014 -24.9402 0.1959
quadrupole: 18.3010 -6.1714 -12.1296 0.8014 -24.9402 0.1959
hfenergy: -885.1998738 hartree
pointgroup: C01 [X(C16H28N2O2)]
dipole: 0.0092692 -0.044328 -2.5672996 debye
polarizability: 251.5477438|-2.7110723|171.0789156|0.0881316|-0.0023035|163.2969295 unknown
InChI: InChI=1S/C16H28N2O2/c1-13-11-17(13)15(19)9-7-5-3-4-6-8-10-16(20)18-12-14(18)2/h13-14H,3-12H2,1-2H3
charge 0 multiplicity 1
48 atoms
O  -5.785543 -1.614539 1.471638
O  5.778854 1.660772 1.391823
N  -6.937402 -0.043497 0.18652
N  6.93325 0.040187 0.172063
C  -7.307438 0.176122 -1.241773
C  7.316765 -0.228072 -1.244444
C  -8.083429 -0.808876 -0.345126
C  8.089611 0.780867 -0.372276
C  -5.766751 -0.567694 0.762105
C  5.760077 0.591122 0.717304
C  -7.878985 1.522579 -1.644588
C  7.883532 -1.590599 -1.596924
C  -4.519705 0.298749 0.565445
C  4.510074 -0.274581 0.535912
C  -3.210405 -0.519607 0.574403
C  3.20152 0.543939 0.552158
C  -1.952842 0.376386 0.558783
C  1.943769 -0.351917 0.546268
C  -0.636121 -0.432562 0.553542
C  0.627102 0.457136 0.549089
H  -6.638133 -0.293847 -1.978312
H  6.658226 0.221633 -2.003046
H  -7.937194 -1.88603 -0.492242
H  -9.071354 -0.517127 0.027984
H  7.951648 1.853487 -0.55594
H  9.071665 0.495698 0.020868
H  -7.073884 2.258328 -1.824215
H  -8.532417 1.919714 -0.848893
H  -8.471822 1.428045 -2.572901
H  8.526022 -1.965413 -0.78173
H  8.486548 -1.530433 -2.521533
H  7.075406 -2.326741 -1.760646
H  -4.615992 0.895539 -0.362131
H  -4.499269 1.0291 1.4009
H  4.598334 -0.87499 -0.39038
H  4.497311 -1.002979 1.373253
H  -3.207703 -1.167805 1.470457
H  -3.192756 -1.200686 -0.300464
H  3.17867 1.223582 -0.323602
H  3.204359 1.194295 1.44661
H  -1.976571 1.041979 -0.330022
H  -1.967389 1.043382 1.446362
H  1.961293 -1.018495 -0.341958
H  1.964105 -1.018002 1.434442
H  -0.613973 -1.097701 1.441667
H  -0.618943 -1.099649 -0.33389
H  0.60423 1.123573 -0.338697
H  0.610748 1.12293 1.436838
