program: Gaussian 09
title: 000229756
version: EM64L-G09RevD.01
frameworkgroup: C1[X(C6H6F6N2O2)]
method: RPBEPBE
basis: SDD
operation: Freq
keyword: #p
keyword: freq=noraman
keyword: PBEPBE/SDD
title: #p freq=noraman PBEPBE/SDD
converged: YES YES NO NO
title: Mulliken charges:
elementType: F F F F F F O O N N C C C C C C H H H H H H
charge: -0.177530 -0.134257 -0.141671 -0.177524 -0.134408 -0.141519 -0.215016 -0.215029 -0.358648 -0.358651 -0.369253 -0.369239 0.182830 0.182860 0.316328 0.316313 0.274322 0.265386 0.265390 0.274296 0.357510 0.357511
chargesum: 0.00000
title: Mulliken charges with hydrogens summed into heavy atoms:
elementType: F F F F F F O O N N C C C C C C
charge: -0.177530 -0.134257 -0.141671 -0.177524 -0.134408 -0.141519 -0.215016 -0.215029 -0.001138 -0.001140 0.170454 0.170447 0.182830 0.182860 0.316328 0.316313
polarizability: 9.95239448e+01 3.14922881e-03 8.01959278e+01 -1.32229551e+01 -6.39010485e-04 7.86775576e+01
1716.lowfreq: -10.7420 -0.0009 -0.0004 0.0011 5.7466 6.4226 14.9370 21.4505 25.4423
frequency: 14.8471 21.3503 25.3949 37.0554 50.6234 88.8023 104.9477 187.2408 188.7184 215.5817 245.5003 281.2394 282.7271 294.5388 329.5857 375.4137 375.8772 388.2089 438.5447 446.1058 508.4426 512.3867 534.0017 604.8982 634.2735 645.9423 648.1450 715.4494 715.6162 781.2843 810.5976 868.2057 874.0073 1009.9971 1011.7161 1027.4884 1035.1640 1039.8503 1042.4361 1111.2573 1137.7985 1154.9556 1246.4103 1259.3073 1271.9672 1296.9411 1350.2849 1365.9506 1456.8993 1458.6533 1502.3426 1504.7477 1650.5734 1652.0990 3019.9733 3028.7622 3099.6378 3116.1178 3548.1225 3548.2549
redmass: 13.8935 15.5496 15.6296 14.2307 9.5955 6.6087 7.4967 7.4826 4.8228 4.7631 10.3563 7.0866 4.5576 10.1541 5.3395 14.5846 15.0311 3.7491 15.6074 14.3483 9.3324 12.7496 2.5342 1.2443 10.0592 10.8781 1.1795 8.3487 11.4868 4.4250 4.6326 2.4554 3.5869 8.9331 10.5283 3.8819 4.4927 9.6810 11.6067 2.6148 6.4516 6.7868 1.5713 2.3948 1.6661 1.1648 1.2205 1.2601 1.1666 1.1161 1.7509 1.7680 9.4422 8.8675 1.0628 1.0636 1.1029 1.1017 1.0788 1.0786
irintensity: 2.0478 1.1975 0.3366 1.8331 8.8600 5.0856 1.1380 4.4808 1.8875 6.2615 3.8282 17.5384 0.1776 0.4028 20.4730 0.0129 5.8944 7.4310 16.7372 4.7547 0.5084 0.0164 12.5934 184.1813 18.0016 20.2044 40.8380 14.1409 4.3878 34.9970 31.6860 41.4006 0.8767 336.9631 43.1619 67.8863 5.8672 336.1036 128.1844 2.1728 259.2644 107.3714 2.5090 10.3866 5.4455 2.0299 11.8428 32.5839 4.3691 50.5874 56.3291 146.0119 417.8345 25.8046 6.9508 20.8738 1.8812 3.1665 79.8226 38.3364
temp: 298.150 k
press: 1.00000 atm
elementType: 9 9 9 9 9 9 8 8 7 7 6 6 6 6 6 6 1 1 1 1 1 1
symmnumber: 1
zpe: 354054.3 jmol-1
zpe.correction: 0.134852 hartree
zpe.thermalcorrener: 0.151030 hartree
zpe.thermalcorrenthalpy: 0.151974 hartree
zpe.thermalcorrgfe: 0.086703 hartree
zpe.sumelectzpe: -1090.024368 hartree
zpe.sumelectthermal: -1090.008190 hartree
zpe.sumelectthermalent: -1090.007246 hartree
zpe.sumelectthermalfe: -1090.072517 hartree
dipole: 0.0011 1.6016 0.0006
dipole: 1.6016
quadrupole: -117.6514 -90.6868 -90.0031
quadrupole: 0.0004 10.8526 -0.0011
quadrupole: -18.2043 8.7603 9.4440 0.0004 10.8526 -0.0011
hfenergy: -1090.1592197 hartree
pointgroup: C01[X(C6H6F6N2O2)]
dipole: -0.000584 0.6301221 -0.0004704 debye
dipolederiv: -0.4257165 -0.0076897 0.1121706 -0.0109113 -0.5443044 -0.2633022 0.1244759 -0.2269868 -0.635922 -0.8572171 0.0755876 -0.1018534 -0.0005817 -0.3581826 0.0137725 -0.1052137 0.0341289 -0.2756621 -0.3492416 -0.0636175 -0.0173247 -0.067163 -0.5475249 0.2784897 -0.0332292 0.2374473 -0.579259 -0.4260854 0.0074139 0.112232 0.0105868 -0.5444885 0.2633858 0.1246526 0.227144 -0.6353603 -0.8567054 -0.0760503 -0.1026841 -0.0000017 -0.3585059 -0.0139471 -0.1061401 -0.0344046 -0.2760714 -0.3491646 0.0642725 -0.0164462 0.0678154 -0.5472751 -0.2785792 -0.0324677 -0.2374856 -0.5793924 -0.6051633 -0.0804496 0.1156278 0.1456094 -0.5208526 -0.2899067 0.3346419 -0.1086863 -0.6547413 -0.6051273 0.080582 0.1153758 -0.1452128 -0.5204613 0.2899891 0.3345111 0.1087171 -0.6552235 -0.9496296 -0.072257 0.2330582 -0.1319468 -0.4314624 0.0615368 0.2142945 0.0392193 -0.6300487 -0.9494903 0.072248 0.2329344 0.131971 -0.4313092 -0.0616437 0.2142314 -0.0392571 -0.630277 0.3832289 0.1488858 0.0326768 0.2711493 0.3275137 -0.0737871 0.067295 0.017515 0.1339205 0.3834583 -0.1488021 0.0326904 -0.2710664 0.32738 0.0736857 0.0674199 -0.0175738 0.133927 0.9163579 0.1512962 -0.4963867 -0.0104826 0.4888125 0.3039234 -0.7007192 0.186711 0.8088176 0.9162702 -0.1517642 -0.4959544 0.0099607 0.4879749 -0.3039965 -0.7003007 -0.1868731 0.8096809 1.5923705 -0.0729486 0.0114499 0.0012686 1.3239071 -0.0965217 0.0349022 -0.1008828 1.4545054 1.5920179 0.0732079 0.0111811 -0.0009882 1.3244916 0.0967581 0.0347121 0.1011807 1.4543115 0.0747602 -0.0581753 0.0705847 -0.0460067 0.0848281 -0.0470141 0.0450488 -0.0182393 -0.0054821 -0.0386808 0.0939459 -0.0151831 0.000832 -0.0438674 0.0245494 -0.0398847 -0.026654 0.1136991 -0.0386386 -0.0939543 -0.0150871 -0.0008656 -0.0438905 -0.0244466 -0.0398884 0.0267482 0.1136798 0.0746269 0.0581954 0.0705187 0.0460233 0.0849132 0.0469644 0.0450168 0.0181797 -0.0055624 0.2589223 -0.0331564 0.0551932 -0.0736577 0.2211209 -0.0275879 0.05838 -0.0378693 0.2702236 0.2588475 0.03323 0.055226 0.073668 0.2211828 0.0276777 0.0582617 0.0379215 0.2702368 unknown
polarizability: 99.8124252|-0.0031897|80.1959251|-12.9903633|-0.0033872|78.3890799 unknown
InChI: InChI=1S/C6H6F6N2O2/c7-5(8,9)3(15)13-1-2-14-4(16)6(10,11)12/h13-14H,1-2H2
charge 0 multiplicity 1
22 atoms
F  -2.755113 -1.544956 -1.250169
F  -4.566063 -0.505965 -0.348444
F  -3.156189 -1.678575 0.984085
F  2.754708 -1.543906 1.250066
F  4.565894 -0.502389 0.351711
F  3.159816 -1.676536 -0.983462
O  -2.685723 1.260959 1.074317
O  2.684423 1.261184 -1.075498
N  -1.328491 0.634361 -0.729047
N  1.328047 0.635489 0.728816
C  -0.442555 1.80829 -0.636921
C  0.441564 1.808951 0.635915
C  -2.379172 0.477774 0.13546
C  2.37858 0.478665 -0.135846
C  -3.218771 -0.807585 -0.117006
C  3.219233 -0.80578 0.117751
H  0.194934 1.834344 -1.534475
H  -1.059285 2.725285 -0.612613
H  1.057922 2.72617 0.610927
H  -0.19588 1.835343 1.533493
H  -1.172308 -0.06379 -1.459633
H  1.172131 -0.062333 1.459774
