program: Gaussian 09
title: 000229769
version: EM64L-G09RevD.01
frameworkgroup: C1[X(C14H22N6O3)]
method: RPBEPBE
basis: SDD
operation: Freq
keyword: #p
keyword: freq=noraman
keyword: PBEPBE/SDD
title: #p freq=noraman PBEPBE/SDD
converged: YES YES NO NO
title: Mulliken charges:
elementType: O O O N N N N N N C C C C C C C C C C C C C C H H H H H H H H H H H H H H H H H H H H H H
charge: -0.279859 -0.263539 -0.241860 -0.200062 -0.130133 -0.162832 -0.109712 -0.222535 0.065623 -0.361658 -0.359500 -0.414628 0.158457 0.213132 0.104472 -0.362198 0.167067 -0.356496 0.209166 -0.635257 -0.615196 -0.694660 -0.599836 0.222126 0.218566 0.194523 0.198413 0.250796 0.250526 0.192703 0.196235 0.195966 0.198244 0.252367 0.290033 0.252569 0.245895 0.274848 0.245253 0.211560 0.210247 0.217608 0.251712 0.270316 0.251541
chargesum: 0.00000
title: Mulliken charges with hydrogens summed into heavy atoms:
elementType: O O O N N N N N N C C C C C C C C C C C C C C
charge: -0.279859 -0.263539 -0.241860 -0.200062 -0.130133 -0.162832 -0.109712 -0.222535 0.065623 0.079033 0.033436 0.086694 0.158457 0.213132 0.104472 0.026740 0.167067 0.037714 0.209166 0.159711 0.150799 -0.055244 0.173733
polarizability: 3.02617343e+02 3.76859517e+01 2.46706933e+02 -2.20585398e+01 1.10249336e+01 1.32987202e+02
1716.lowfreq: -14.2881 -8.9969 -0.0009 -0.0003 0.0005 1.0367 7.3681 9.4146 24.4412
frequency: -8.9874 8.7015 23.9969 47.0722 54.8068 67.8050 84.6965 90.6961 106.6844 108.9454 120.7394 124.8779 128.2569 129.9966 140.0547 189.7358 208.9684 220.7357 224.4556 241.9219 247.2659 272.7460 276.1847 310.3859 319.6102 335.5027 345.5871 360.4320 377.7013 389.1459 393.0804 428.5188 440.9030 471.3609 503.4952 525.3557 602.7012 641.9076 658.0647 688.4744 704.0548 718.6670 725.6010 734.6250 736.9246 764.7698 776.2620 799.2260 848.0325 887.9924 903.8726 947.6750 959.4578 995.3945 1006.6330 1016.6137 1028.3324 1051.1945 1061.2411 1068.7392 1076.6840 1117.5093 1128.6614 1130.1959 1132.4000 1164.8293 1185.0420 1193.5785 1206.0978 1229.3605 1231.8616 1233.1105 1262.5967 1267.5659 1283.5650 1290.0696 1292.3198 1298.9016 1315.1446 1328.0319 1335.3970 1353.0802 1356.2545 1371.7691 1385.7456 1396.4845 1415.4102 1427.9791 1434.0351 1454.9233 1462.8959 1463.5653 1466.5010 1471.2427 1474.8854 1475.1929 1476.4455 1478.9136 1479.5055 1480.3879 1485.8817 1487.6942 1503.2811 1505.6548 1576.9545 1615.9682 1642.2873 2953.9681 2958.2319 2968.6553 2972.6892 2989.8741 2992.2046 3006.7694 3008.1822 3013.7662 3014.1467 3028.1164 3031.7684 3054.8892 3069.5058 3072.8322 3095.9099 3105.0564 3105.9215 3117.6300 3127.3411 3139.4620 3141.4998
redmass: 3.1139 5.2072 1.8261 4.8888 3.4720 3.8760 1.6030 1.7999 4.8046 1.8530 2.3071 1.1914 3.0190 3.9281 4.2527 6.5998 1.6873 1.4897 1.4406 4.0595 4.4148 4.4585 3.7246 2.9871 6.2284 3.3255 4.4468 4.2970 4.3912 7.3578 7.8000 5.4266 3.9599 6.9319 6.7971 5.5765 6.1274 10.6455 7.2829 11.3623 11.2212 3.7060 1.0680 1.4120 10.3806 1.5063 4.7405 3.0182 1.7989 1.9104 1.8973 2.3237 5.9169 1.3333 4.2364 3.3689 3.2077 3.0766 2.8129 2.6757 2.2916 2.5970 1.3026 1.3025 1.2999 2.0436 3.6166 2.7562 1.8437 2.8008 2.4784 1.3623 1.3920 6.2722 1.0454 1.2869 1.1839 5.4139 1.2498 5.1912 1.4355 1.6565 1.3915 5.8849 1.2159 2.7531 1.2821 1.2609 1.1969 1.9361 1.0954 1.0759 1.2540 1.0734 1.0437 1.0448 1.1711 1.0868 1.0534 1.0767 1.0436 1.0887 2.4411 3.3038 7.7251 10.8135 9.4683 1.0588 1.0590 1.0593 1.0361 1.0595 1.0971 1.0337 1.1017 1.0328 1.0326 1.0635 1.0998 1.1036 1.1008 1.0993 1.1026 1.1043 1.1022 1.1021 1.1051 1.1010 1.1024
irintensity: 0.0132 0.3044 0.0050 2.0065 0.5971 0.3142 0.4935 0.5372 0.4885 0.2811 0.0470 1.3418 15.0464 1.6862 0.4876 2.7968 1.7248 0.5588 0.6649 1.9452 8.3904 2.9333 7.1523 4.7325 0.7306 2.5484 0.7323 7.6840 3.5733 0.9167 23.5220 3.0521 1.4345 13.7304 27.3115 9.8848 4.9260 5.2540 15.1353 1.4199 8.1011 5.8655 10.9319 3.2483 14.6755 1.4562 9.7010 79.3653 46.5228 5.0749 16.0973 58.9728 36.1160 20.6613 0.8175 4.3317 20.2276 35.8914 5.6267 85.9235 6.3226 17.4741 0.2756 0.2065 0.1142 9.7542 14.6098 10.8667 5.3603 9.0823 54.9037 8.1516 14.5430 59.4387 1.7387 1.4662 11.4289 57.0971 8.4532 231.6035 13.3062 0.9858 21.4488 77.4685 11.1094 4.0595 4.9638 53.4452 31.7271 205.0566 2.2450 0.9289 25.2491 2.0158 16.4018 12.6318 11.7683 11.9985 15.2705 7.6675 20.6111 22.1876 174.2716 78.0270 21.8343 662.7641 470.9190 0.0843 9.0348 84.3423 37.8201 27.1281 1.7899 32.6050 0.4115 40.1190 12.6271 19.1204 32.2482 34.2261 90.8635 53.2212 17.9157 4.7794 16.1414 10.4822 1.0438 0.3512 0.9379
temp: 298.150 k
press: 1.00000 atm
elementType: 8 8 8 7 7 7 7 7 7 6 6 6 6 6 6 6 6 6 6 6 6 6 6 1 1 1 1 1 1 1 1 1 1 1 1 1 1 1 1 1 1 1 1 1 1
symmnumber: 1
zpe: 953789.6 jmol-1
zpe.correction: 0.363279 hartree
zpe.thermalcorrener: 0.387210 hartree
zpe.thermalcorrenthalpy: 0.388154 hartree
zpe.thermalcorrgfe: 0.307464 hartree
zpe.sumelectzpe: -1099.097671 hartree
zpe.sumelectthermal: -1099.073741 hartree
zpe.sumelectthermalent: -1099.072796 hartree
zpe.sumelectthermalfe: -1099.153487 hartree
dipole: 2.6250 -1.2544 -0.6922
dipole: 2.9906
quadrupole: -146.0646 -153.4561 -135.0887
quadrupole: -10.9320 0.4756 -0.5195
quadrupole: -1.1948 -8.5863 9.7811 -10.9320 0.4756 -0.5195
hfenergy: -1099.4609507 hartree
pointgroup: C01 [X(C14H22N6O3)]
dipole: 1.0034043 -0.5708623 -0.2272693 debye
polarizability: 306.8757061|32.5195098|243.7989594|-23.432216|3.9890381|131.6368122 unknown
InChI: InChI=1S/C14H22N6O3/c1-5-6-7-8-9-20(16-23)13-15-11-10(17(13)2)12(21)19(4)14(22)18(11)3/h5-9H2,1-4H3
charge 0 multiplicity 1
45 atoms
O  -4.147359 1.763744 0.511619
O  -4.071481 -2.873305 -0.330523
O  2.571077 3.585806 -0.905808
N  -1.116833 1.733669 -0.29967
N  1.290567 1.724871 -0.945212
N  -2.069498 -1.693511 -0.656956
N  -0.10165 -0.235866 -0.921753
N  -4.073237 -0.564824 0.079554
N  1.397695 3.121899 -0.702997
C  3.223837 0.288324 -0.200046
C  4.444997 -0.522225 -0.689134
C  2.455614 0.913412 -1.386405
C  -2.085431 0.709588 -0.224892
C  0.053027 1.109163 -0.723023
C  -1.425956 -0.468864 -0.611245
C  5.217702 -1.191852 0.469828
C  -3.476582 0.744805 0.152275
C  6.440589 -2.007945 -0.007889
C  -3.439541 -1.779939 -0.305673
C  -1.384759 3.153711 0.022826
C  -1.342618 -2.90966 -1.069489
C  7.201029 -2.685014 1.152873
C  -5.505404 -0.687689 0.440711
H  2.537724 -0.373698 0.362078
H  3.557934 1.089311 0.487046
H  4.108473 -1.302903 -1.402723
H  5.13225 0.143835 -1.250826
H  2.073421 0.125268 -2.054113
H  3.113057 1.600695 -1.948061
H  4.530869 -1.857916 1.03248
H  5.554028 -0.414028 1.186229
H  6.10422 -2.778804 -0.731091
H  7.130139 -1.340097 -0.563346
H  -1.182004 3.789994 -0.852428
H  -2.443811 3.226511 0.313932
H  -0.73608 3.488351 0.846878
H  -0.958455 -2.791723 -2.096608
H  -2.050367 -3.749904 -1.023747
H  -0.491895 -3.090773 -0.391401
H  7.573783 -1.933687 1.874246
H  6.542712 -3.381858 1.705266
H  8.070293 -3.260842 0.785855
H  -6.077031 -1.084267 -0.414029
H  -5.862161 0.316122 0.712485
H  -5.622583 -1.383189 1.287614
