program: Gaussian 09
title: 000229733
version: EM64L-G09RevD.01
frameworkgroup: C1[X(C18H18N4)]
method: RPBEPBE
basis: SDD
operation: Freq
keyword: #pfreq=noraman
keyword: PBEPBE/SDD
title: #p freq=noraman PBEPBE/SDD
converged: YES YES NO NO
title: Mulliken charges:
elementType: N N N N C C C C C C C C C C C C C C C C C C H H H H H H H H H H H H H H H H H H
charge: -0.212308 -0.079156 -0.454974 -0.121862 -0.538711 -0.364688 0.174379 -0.512389 0.297933 0.216161 0.003949 0.259861 -0.699773 0.028188 -0.379339 -0.349885 -0.229345 -0.363727 -0.236178 -0.352241 -0.213543 -0.228672 0.252889 0.241788 0.226402 0.228840 0.225796 0.242949 0.310192 0.233031 0.315433 0.231207 0.233072 0.244625 0.218915 0.234660 0.221101 0.242509 0.226046 0.226866
chargesum: 0.00000
title: Mulliken charges with hydrogens summed into heavy atoms:
elementType: N N N N C C C C C C C C C C C C C C C C C C
charge: -0.212308 -0.079156 -0.144781 -0.121862 -0.044033 0.090553 0.174379 -0.043645 0.297933 0.216161 0.003949 0.259861 0.079898 0.028188 -0.146268 -0.105261 -0.010430 -0.129066 -0.015077 -0.109732 0.012503 -0.001805
polarizability: 3.23451110e+02 -4.39215746e+00 2.30934615e+02 1.30678738e+01 9.69194147e+00 1.12821032e+02
1716.lowfreq: -7.4664 -0.0008 -0.0006 -0.0005 0.6072 4.5820 18.7625 28.3600 32.5183
frequency: 18.7180 28.3325 32.5116 59.5123 83.0467 126.1417 128.0627 158.8064 190.1330 210.4264 228.2392 252.5830 255.0474 284.4684 296.5115 305.1953 355.2868 381.1339 429.0045 441.9978 464.1756 513.8374 530.4295 552.6253 573.0028 579.1235 585.1900 602.0000 614.9090 644.2087 656.4359 663.1068 705.0504 729.9012 753.2392 753.7547 770.2297 770.9071 773.6535 821.6545 834.9795 853.6439 856.7575 875.8267 880.7082 897.0710 932.3514 936.2284 956.4568 972.1447 976.9022 1002.6380 1005.2628 1015.2251 1041.2123 1065.5170 1082.9882 1110.7115 1123.2975 1126.5653 1135.8819 1158.1525 1160.6140 1181.3514 1194.4122 1207.4289 1216.3710 1232.5307 1259.8810 1263.9084 1279.3897 1288.3142 1301.0803 1323.6053 1328.7934 1354.3584 1375.7068 1379.1830 1401.3440 1414.8018 1441.3708 1441.6613 1455.7055 1457.2237 1465.5562 1467.8289 1475.3967 1475.7342 1495.6540 1502.4037 1510.6035 1522.8997 1594.1327 1596.2715 1627.4254 1634.2554 2962.7713 2968.1820 3000.9375 3007.4107 3018.2226 3053.7310 3059.2488 3080.6728 3084.8622 3125.6575 3131.8350 3138.2991 3143.5105 3153.4668 3157.5744 3167.2825 3170.8162 3593.4649
redmass: 4.6711 4.0712 4.9759 5.4706 4.1510 4.7410 2.2160 3.0905 1.9972 2.3368 2.2066 3.8060 3.5060 4.0291 2.4073 3.7131 4.0663 4.2321 2.8806 3.1530 4.8237 5.6416 3.5039 4.6452 4.9039 3.4506 3.8507 1.3053 6.6645 3.3889 3.5417 4.5314 4.8338 4.3889 1.4185 1.3370 3.6557 3.7235 1.6734 3.6791 3.0214 1.5160 1.5037 3.7001 5.9921 2.9839 1.3822 1.3823 3.9883 1.2990 1.3067 2.2151 2.0341 2.5016 2.4544 2.5705 2.9087 1.6391 1.4657 1.3049 1.6514 1.1631 1.1423 1.8197 1.5229 1.6058 1.7347 3.2638 1.9642 2.2684 1.8115 1.4189 1.3183 2.5348 1.7986 1.4106 2.3464 3.0298 4.0790 2.9473 2.0647 2.4467 1.3210 1.4029 1.8915 1.1381 3.0994 1.5708 1.9278 1.0848 1.9603 4.3378 7.0508 6.9539 7.6872 7.3769 1.0595 1.0337 1.0791 1.0698 1.0703 1.1014 1.1006 1.1035 1.1034 1.0849 1.0854 1.0900 1.0901 1.0954 1.0956 1.0993 1.0999 1.0812
irintensity: 0.5237 3.8224 2.6093 0.3471 0.6793 4.5955 1.5032 0.8600 2.9294 0.7430 2.1762 4.9442 3.2106 1.3486 2.6892 0.2104 1.6253 7.8038 7.2731 7.2778 2.7209 0.8899 1.2217 1.9133 2.1979 3.2514 0.2181 73.0390 0.7105 14.7858 3.6603 4.7573 3.1054 8.5010 43.5385 164.7907 6.2934 2.0701 1.3930 6.1383 5.1144 0.2803 0.0725 2.4596 1.1477 7.0653 3.1625 3.6824 0.5386 0.1065 0.0140 5.6867 8.7001 11.9907 13.6290 4.5084 1.7512 2.6495 16.7527 0.8476 3.4974 3.6399 2.7558 3.9670 9.2722 8.3752 2.7003 15.0901 46.5935 30.7503 1.4244 8.1235 6.5014 15.0162 74.1314 4.2689 44.8167 36.6104 9.9109 4.0346 27.7251 48.3762 18.6506 17.8526 1.8845 22.8157 1.1444 28.0378 1.8723 6.2183 68.3200 50.4529 0.0140 2.1031 8.6193 5.5543 33.8302 33.0198 5.9434 4.3393 47.0186 24.4760 2.7954 46.7828 23.5711 0.3256 0.0252 14.3421 9.5967 28.5660 28.6257 28.0252 19.5200 44.5697
temp: 298.150 k
press: 1.00000 atm
elementType: 7 7 7 7 6 6 6 6 6 6 6 6 6 6 6 6 6 6 6 6 6 6 1 1 1 1 1 1 1 1 1 1 1 1 1 1 1 1 1 1
symmnumber: 1
zpe: 852388.7 jmol-1
zpe.correction: 0.324658 hartree
zpe.thermalcorrener: 0.342844 hartree
zpe.thermalcorrenthalpy: 0.343788 hartree
zpe.thermalcorrgfe: 0.276499 hartree
zpe.sumelectzpe: -914.206781 hartree
zpe.sumelectthermal: -914.188595 hartree
zpe.sumelectthermalent: -914.187651 hartree
zpe.sumelectthermalfe: -914.254940 hartree
dipole: -5.8734 -0.6552 1.0409
dipole: 6.0008
quadrupole: -120.3741 -113.0486 -135.3221
quadrupole: 17.8341 5.8712 -0.6657
quadrupole: 2.5409 9.8663 -12.4072 17.8341 5.8712 -0.6657
hfenergy: -914.531439 hartree
pointgroup: C01 [X(C18H18N4)]
dipole: -2.2817252 0.1643907 -0.5836331 debye
polarizability: 324.2935826|3.1405076|230.4302261|-1.3220261|-12.4084398|112.4829484 unknown
InChI: InChI=1S/C18H18N4/c1-22-16-10-5-4-9-15(16)21-18(22)12-6-11-17-19-13-7-2-3-8-14(13)20-17/h2-5,7-10,19H,6,11-12H2,1H3
charge 0 multiplicity 1
40 atoms
N  2.155798 -0.47969 0.091641
N  3.100751 1.561685 0.547483
N  -3.734084 1.498426 -0.672318
N  -2.109334 -0.094581 -0.601337
C  0.593902 1.538188 0.257739
C  0.089469 1.756962 -1.196617
C  1.950341 0.898681 0.312339
C  -1.372097 2.255345 -1.25198
C  3.53726 -0.706528 0.199959
C  -2.370666 1.20503 -0.8366
C  4.114712 0.578887 0.483068
C  -4.394008 0.312775 -0.311092
C  1.148503 -1.515575 -0.167098
C  -3.356599 -0.68007 -0.2707
C  4.315348 -1.876612 0.082291
C  5.512141 0.700363 0.652322
C  5.70992 -1.73358 0.254126
C  -5.740448 0.013227 -0.021787
C  6.298808 -0.465405 0.534427
C  -3.670996 -2.014823 0.068851
C  -6.033719 -1.326269 0.315478
C  -5.01631 -2.32383 0.359902
H  -0.143653 0.922904 0.804593
H  0.674832 2.511696 0.771755
H  0.163467 0.813585 -1.766536
H  0.745317 2.49447 -1.694713
H  -1.487881 3.152215 -0.608615
H  -1.605363 2.584043 -2.285734
H  -4.161284 2.41495 -0.794964
H  1.131944 -2.252208 0.65792
H  0.145404 -1.067564 -0.264054
H  1.382194 -2.048421 -1.107459
H  3.87014 -2.8543 -0.131825
H  5.959044 1.675864 0.868218
H  6.354472 -2.615951 0.170526
H  -6.528984 0.772387 -0.053204
H  7.38525 -0.399179 0.660456
H  -2.88784 -2.778551 0.10134
H  -7.066967 -1.605885 0.548514
H  -5.288984 -3.350757 0.625984
