program: Gaussian 09
title: 000229725
version: EM64L-G09RevD.01
frameworkgroup: C1[X(C19H14N2O4)]
method: RPBEPBE
basis: SDD
operation: Freq
keyword: #p
keyword: freq=noraman
keyword: PBEPBE/SDD
title: #p freq=noraman PBEPBE/SDD
converged: YES YES NO NO
title: Mulliken charges:
elementType: O O O O N N C C C C C C C C C C C C C C C C C C C H H H H H H H H H H H H H H
charge: -0.436531 -0.219610 -0.200136 -0.199121 -0.338092 0.021051 0.280560 0.349628 0.364161 0.140959 -0.499432 0.414654 -0.293061 -0.367467 -0.385477 -0.361612 -0.341023 -0.407304 -0.209506 -0.206827 -0.209083 -0.215511 0.091769 -0.250809 -0.253483 0.327133 0.285382 0.268276 0.257592 0.262172 0.269446 0.291238 0.230185 0.229289 0.231025 0.229447 0.232990 0.230579 0.386547
chargesum: 0.00000
title: Mulliken charges with hydrogens summed into heavy atoms:
elementType: O O O O N N C C C C C C C C C C C C C C C C C C C
charge: -0.049984 -0.219610 -0.200136 -0.199121 -0.338092 0.021051 0.280560 0.349628 0.364161 0.140959 -0.172299 0.414654 -0.007678 -0.099190 -0.127885 -0.099440 -0.071576 -0.116066 0.020680 0.022462 0.021942 0.013936 0.091769 -0.017818 -0.022904
polarizability: 3.21200525e+02 -1.54019575e+01 2.95931534e+02 8.49682255e+00 3.43226338e+00 1.66619368e+02
1716.lowfreq: -4.4106 -0.0006 -0.0004 -0.0003 1.7933 3.8033 22.9628 39.7634 44.9791
frequency: 22.9375 39.7391 44.9667 46.8630 60.2006 61.3271 74.3165 82.4474 86.4512 150.1186 166.7186 199.1037 234.3692 242.9179 255.6002 273.4200 290.6630 313.9052 322.1967 405.5140 408.1089 424.3873 438.1181 474.5569 484.9867 506.8181 522.4736 526.1876 567.9255 581.5966 611.4899 613.8936 617.9437 626.0308 643.7361 670.8897 693.5295 695.7475 700.5850 707.3276 733.2176 756.4548 760.0987 766.1326 810.7686 837.2420 843.5711 852.9111 899.2388 908.1550 918.0486 932.5667 961.3302 971.1887 973.9344 985.8571 987.8804 989.3140 990.5832 991.1100 996.2489 1024.6086 1027.0864 1077.9360 1085.3469 1087.5708 1124.8135 1154.7273 1172.2639 1173.0013 1176.1493 1185.9681 1190.1665 1211.9742 1252.0455 1280.3817 1283.5575 1308.2926 1317.4018 1326.5382 1369.4320 1373.3136 1386.1257 1389.7814 1419.8483 1440.4428 1448.1398 1470.2869 1478.1463 1480.1290 1567.5922 1586.6491 1592.0440 1598.5958 1601.9111 1612.1204 1633.1619 3128.7964 3131.0090 3136.9960 3137.7070 3149.8203 3151.5044 3158.2940 3162.3499 3171.4507 3173.9330 3178.0154 3180.7634 3198.9717 3527.6550
redmass: 7.1459 5.0527 6.3661 7.3591 6.0914 5.4901 4.7983 7.9613 5.1877 8.5600 6.4867 5.6230 4.8858 5.5647 5.9809 6.6942 8.6160 5.5855 5.9715 2.8736 2.8958 3.7723 5.1244 6.5966 4.8330 4.4112 4.7828 5.1920 5.0123 1.3303 5.9456 5.5305 5.5994 6.3896 6.3439 4.3474 2.1337 2.0652 5.2428 5.6412 6.8965 2.0077 1.7767 3.6232 6.2990 1.2572 1.2510 1.4814 2.6185 1.4325 1.6710 1.7273 4.8863 1.3831 1.3958 5.9239 4.4622 2.1845 1.3391 1.3849 2.1849 2.2026 2.0239 2.0253 1.5635 1.5844 1.7276 1.7300 1.0521 1.0521 2.0861 1.1194 1.3137 9.4037 1.7573 2.8572 3.1212 2.3336 1.4734 1.4229 5.6278 9.7649 9.4867 8.3933 5.5951 2.3635 2.4215 2.8068 2.3087 2.3329 8.0575 6.5136 6.6072 6.9055 6.0277 6.3496 8.7276 1.0849 1.0849 1.0885 1.0883 1.0938 1.0926 1.0964 1.0968 1.1015 1.0994 1.0893 1.0918 1.0967 1.0642
irintensity: 0.8434 1.3851 0.2251 0.2379 0.2009 0.9032 0.2747 1.4312 1.5264 1.2181 0.8571 2.1249 3.4832 4.9292 1.0726 2.1354 2.6254 0.1061 3.6799 1.7856 0.4307 9.6338 1.7927 10.0859 32.5034 18.2774 7.6337 9.8345 3.5582 87.5365 1.3959 2.0385 5.6382 7.9511 15.5373 39.5633 36.1137 34.8027 19.2689 15.0719 50.4130 10.0507 81.9473 4.6150 13.9302 0.3328 0.3342 30.8777 5.1332 3.9278 5.6292 12.7989 27.3776 2.1378 1.0839 0.1538 1.4060 144.9854 0.1713 0.0945 133.5965 7.2232 16.0399 43.1343 11.7924 2.5762 81.8096 112.7067 0.3456 0.1341 3.8935 3.7707 4.8944 301.8949 25.1735 71.3584 138.5404 94.7825 3.5904 11.0973 11.1850 43.1009 3.8802 44.0601 131.0698 15.4339 0.1151 146.2514 110.0655 65.0754 78.0933 11.4166 10.7200 13.7349 69.8152 21.4113 144.0706 3.1720 4.3841 6.0461 3.9497 24.0230 19.2760 21.0982 23.5072 18.0533 8.1667 4.5498 3.9818 3.6353 53.8650
temp: 298.150 k
press: 1.00000 atm
elementType: 8 8 8 8 7 7 6 6 6 6 6 6 6 6 6 6 6 6 6 6 6 6 6 6 6 1 1 1 1 1 1 1 1 1 1 1 1 1 1
symmnumber: 1
zpe: 755147.3 jmol-1
zpe.correction: 0.287620 hartree
zpe.thermalcorrener: 0.308420 hartree
zpe.thermalcorrenthalpy: 0.309364 hartree
zpe.thermalcorrgfe: 0.235946 hartree
zpe.sumelectzpe: -1141.013378 hartree
zpe.sumelectthermal: -1140.992579 hartree
zpe.sumelectthermalent: -1140.991634 hartree
zpe.sumelectthermalfe: -1141.065053 hartree
dipole: -4.4061 -1.3596 1.0149
dipole: 4.7214
quadrupole: -160.2801 -125.9546 -140.4849
quadrupole: -3.8036 12.6534 1.6638
quadrupole: -18.0402 16.2852 1.7550 -3.8036 12.6534 1.6638
hfenergy: -1141.3009986 hartree
pointgroup: C01 [X(C19H14N2O4)]
dipole: 1.3828545 0.8706614 0.883261 debye
polarizability: 328.0938531|3.4979816|267.1058578|-9.400322|46.9339335|188.551717 unknown
InChI: InChI=1S/C19H14N2O4/c22-19(23)17-12-11-16(21(24)25)13-18(17)20(14-7-3-1-4-8-14)15-9-5-2-6-10-15/h1-13,22H
charge 0 multiplicity 1
39 atoms
O  -1.068159 2.274548 3.096737
O  0.698729 0.811062 2.75402
O  -5.114713 -1.090472 -1.390006
O  -3.296632 -1.969531 -2.448883
N  0.714605 -0.091778 -0.056258
N  -3.841184 -1.246838 -1.528877
C  -0.682989 -0.025744 0.186295
C  1.310561 -1.342086 -0.449923
C  1.522068 1.102354 -0.005222
C  -1.252847 0.733381 1.266694
C  -1.563066 -0.691822 -0.71137
C  -2.949628 -0.551412 -0.56007
C  -2.664875 0.88694 1.350475
C  2.301255 -1.381026 -1.466416
C  1.025777 2.31693 -0.544449
C  0.908198 -2.548485 0.182117
C  2.81824 1.0641 0.566555
C  -3.531844 0.251328 0.449801
C  2.876727 -2.612858 -1.841821
C  1.820721 3.482753 -0.503652
C  1.47834 -3.776887 -0.211991
C  3.612803 2.228712 0.584668
C  -0.420354 1.243313 2.39018
C  2.466984 -3.817632 -1.22288
C  3.119521 3.444903 0.055112
H  -1.169085 -1.285694 -1.539667
H  -3.067154 1.492913 2.165861
H  2.610721 -0.453215 -1.957602
H  0.030914 2.344921 -1.00165
H  0.16691 -2.516318 0.987181
H  3.184243 0.13385 1.009897
H  -4.617425 0.345581 0.517079
H  3.637285 -2.632646 -2.630144
H  1.430804 4.415698 -0.92568
H  1.16094 -4.701131 0.283105
H  4.612262 2.190668 1.031803
H  2.912332 -4.772152 -1.522301
H  3.73765 4.348767 0.077527
H  -0.491834 2.539205 3.863259
