program: Gaussian 09
title: 000229713
version: EM64L-G09RevD.01
frameworkgroup: C1[X(C15H22O3)]
method: RPBEPBE
basis: SDD
operation: Freq
keyword: #pfreq=noraman
keyword: PBEPBE/SDD
title: #p freq=noraman PBEPBE/SDD
converged: YES YES NO NO
title: Mulliken charges:
elementType: O O O C C C C C C C C C C C C C C C H H H H H H H H H H H H H H H H H H H H H H
charge: -0.300937 -0.268097 -0.257661 0.329414 -0.380954 -0.352293 -0.749051 -0.725072 -0.402184 -0.698397 0.188548 0.226794 -0.328846 -0.342000 -0.347041 -0.338613 0.331566 -0.537523 0.202711 0.184693 0.211827 0.244495 0.222890 0.208161 0.218595 0.209343 0.230858 0.203870 0.242764 0.201959 0.214592 0.202170 0.216530 0.271957 0.267552 0.255906 0.242857 0.224794 0.225037 0.248786
chargesum: 0.00000
title: Mulliken charges with hydrogens summed into heavy atoms:
elementType: O O O C C C C C C C C C C C C C C C
charge: -0.300937 -0.268097 -0.257661 0.329414 0.006450 0.104029 -0.099405 -0.081000 0.042539 -0.065105 0.188548 0.226794 -0.056890 -0.074448 -0.091136 -0.095756 0.331566 0.161094
polarizability: 2.51991688e+02 -1.62723684e+00 1.67455838e+02 -2.26823449e+01 -1.26064960e+01 1.23561094e+02
1716.lowfreq: -17.2339 -6.3546 -1.4084 -0.0009 -0.0007 -0.0003 15.6011 29.5422 42.8235
frequency: 14.5636 29.4163 42.8095 61.3543 75.5763 85.3888 95.6958 135.3389 140.9526 174.1021 197.1101 213.4793 222.5046 229.5283 236.5163 241.2190 243.1190 279.6335 310.1983 316.2082 338.7095 357.9096 402.4756 417.2981 443.8092 466.3009 479.4866 504.8836 548.1915 593.0235 628.5799 672.7033 726.7812 738.5908 753.2274 763.4023 794.2508 823.1596 853.7366 858.0675 876.8407 895.1516 925.5626 929.3110 947.5094 970.6035 980.0815 983.2162 990.2697 999.1097 1003.1390 1048.8527 1051.9631 1079.4501 1102.1433 1111.5138 1113.0097 1155.3814 1171.9671 1183.6466 1200.7131 1223.6285 1233.7857 1247.3028 1264.0891 1282.9009 1297.3096 1304.7091 1313.6222 1349.6905 1358.9419 1372.4186 1380.9500 1387.2286 1392.8860 1427.4773 1436.5357 1454.1264 1458.3513 1467.8820 1468.4661 1469.2612 1471.0794 1473.6333 1477.8817 1480.6233 1486.2642 1491.8190 1497.3765 1572.5704 1615.2433 1620.2175 2956.7848 2965.0541 2969.9050 2970.6241 2973.8896 2981.3806 3005.2552 3010.1702 3037.7214 3055.7548 3061.5202 3065.3989 3069.3387 3071.9306 3074.4699 3081.6747 3082.7246 3130.0559 3154.0449 3156.8762 3174.1394 3179.5858
redmass: 3.9733 3.7668 3.7890 3.4310 4.3255 2.2608 2.9726 3.0896 4.0379 2.7032 1.0635 1.7210 1.7396 1.3958 2.2355 2.2106 1.3421 4.3209 4.5688 2.5474 2.6079 2.7157 3.0231 2.9741 3.3400 4.0192 2.3915 2.9916 4.4577 5.7579 7.0379 4.2356 4.3916 1.2264 4.4621 3.1812 5.4411 1.3053 1.6261 1.3666 2.0685 2.5809 2.4400 1.6132 1.9063 1.3639 1.6783 5.2694 1.3456 3.0516 1.3234 3.3021 2.9411 1.4855 2.2016 1.2673 1.3342 1.3185 1.2449 2.1963 1.9362 1.9382 3.0002 3.8047 1.4049 1.6439 1.2808 1.4832 1.1931 1.3858 1.4744 1.2122 5.5264 1.2114 1.2127 4.3242 1.1748 1.0760 1.0849 1.0524 1.0531 1.0617 1.0706 1.0456 1.0489 1.0548 1.0847 1.0772 2.4390 7.9526 9.2674 6.6145 1.0592 1.0328 1.0355 1.0357 1.0369 1.0605 1.0929 1.0617 1.1015 1.1043 1.0995 1.0995 1.1002 1.0998 1.0994 1.1010 1.1043 1.0998 1.0884 1.0878 1.0967 1.0966
irintensity: 1.3070 0.3904 0.9405 0.0991 0.4440 0.4236 0.2640 1.9339 6.5734 0.0942 0.2812 1.4572 0.7955 0.5573 3.2019 2.3784 0.4731 9.6816 1.2274 0.0691 4.4388 7.3360 7.1609 0.0907 1.3353 0.9109 0.7332 7.8913 3.4514 24.2356 1.8151 28.2339 7.5880 14.9947 13.3665 9.3934 2.6634 9.9554 55.6019 2.7971 2.8688 1.7690 31.6493 8.7590 15.3469 0.8031 15.4701 67.5314 0.1597 44.3885 0.3336 201.2623 138.3186 19.7387 3.7948 1.0081 7.2976 10.7459 204.3072 0.9608 2.0496 1.3773 67.9387 455.0588 12.6829 6.4357 0.1637 7.4593 2.8749 40.0886 4.9420 22.2855 2.9818 7.5600 15.1500 22.4439 8.7534 6.7191 14.2027 0.7043 19.4377 15.9104 36.8533 4.9516 8.9298 10.6796 14.6064 34.1572 60.5979 60.7646 106.7446 277.0182 21.0718 65.4417 43.3966 28.5517 30.6447 36.0339 12.8078 59.7305 9.0047 43.7456 7.0111 43.5677 76.1321 62.2617 42.3431 42.0786 29.6641 23.6508 0.5671 7.4046 7.6487 4.7946
temp: 298.150 k
press: 1.00000 atm
elementType: 8 8 8 6 6 6 6 6 6 6 6 6 6 6 6 6 6 6 1 1 1 1 1 1 1 1 1 1 1 1 1 1 1 1 1 1 1 1 1 1
symmnumber: 1
zpe: 886644.0 jmol-1
zpe.correction: 0.337705 hartree
zpe.thermalcorrener: 0.357664 hartree
zpe.thermalcorrenthalpy: 0.358608 hartree
zpe.thermalcorrgfe: 0.287755 hartree
zpe.sumelectzpe: -809.076468 hartree
zpe.sumelectthermal: -809.056509 hartree
zpe.sumelectthermalent: -809.055565 hartree
zpe.sumelectthermalfe: -809.126418 hartree
dipole: -1.5394 -3.1917 1.7151
dipole: 3.9368
quadrupole: -89.3433 -107.5348 -111.8656
quadrupole: 5.4000 -5.7823 -0.3532
quadrupole: 13.5713 -4.6203 -8.9510 5.4000 -5.7823 -0.3532
hfenergy: -809.4141733 hartree
pointgroup: C01 [X(C15H22O3)]
dipole: 0.5354425 0.4292989 -1.3885067 debye
polarizability: 247.8503267|31.5825245|124.1755643|-5.447171|-3.3188366|170.9827292 unknown
InChI: InChI=1S/C15H22O3/c1-5-10-15(2,3)11-18-14(16)12-6-8-13(17-4)9-7-12/h6-9H,5,10-11H2,1-4H3
charge 0 multiplicity 1
40 atoms
O  -1.002262 -0.789094 -0.582193
O  -0.751602 -1.021629 1.734982
O  5.109457 1.085863 -0.013553
C  -3.397473 -0.151836 -0.949226
C  -3.339086 1.076545 0.011344
C  -2.412642 -1.262897 -0.507442
C  -4.812871 -0.791698 -0.963305
C  -3.039247 0.321508 -2.383399
C  -3.759224 0.844539 1.482203
C  -3.655452 2.142353 2.314297
C  -0.272063 -0.713041 0.612868
C  1.116484 -0.237036 0.381441
C  1.983869 -0.112339 1.502914
C  1.602104 0.092427 -0.908474
C  3.303385 0.329726 1.338014
C  2.927024 0.537824 -1.087981
C  3.780624 0.656692 0.040365
C  5.664749 1.439063 -1.32465
H  -2.30628 1.481829 -0.004245
H  -3.985637 1.869734 -0.420212
H  -2.464106 -2.118253 -1.205433
H  -2.614028 -1.606344 0.522221
H  -5.081444 -1.231558 0.014405
H  -4.876707 -1.592349 -1.724726
H  -5.573982 -0.02888 -1.211442
H  -3.769032 1.074687 -2.734731
H  -2.032936 0.775827 -2.407844
H  -3.049712 -0.523445 -3.098403
H  -3.114973 0.071677 1.942654
H  -4.800871 0.470161 1.523902
H  -2.615932 2.521029 2.324746
H  -4.299747 2.93922 1.895385
H  -3.96229 1.974069 3.362937
H  1.597928 -0.370104 2.494373
H  0.933391 -0.007329 -1.767869
H  3.985174 0.431535 2.187317
H  3.280612 0.785937 -2.092818
H  5.110959 2.282139 -1.780456
H  5.655607 0.570715 -2.01112
H  6.702232 1.741932 -1.122647
