program: Gaussian 09
title: 000230892
version: EM64L-G09RevD.01
frameworkgroup: C1[X(C9H13N5)]
method: RPBEPBE
basis: SDD
operation: Freq
keyword: #pfreq=noraman
keyword: PBEPBE/SDD
title: #p freq=noraman PBEPBE/SDD
converged: YES YES NO NO
title: Mulliken charges:
elementType: N N N N N C C C C C C C C C H H H H H H H H H H H H H
charge: -0.162313 -0.399649 -0.032568 -0.074874 0.027373 0.117808 -0.312234 0.208332 -0.407691 -0.103480 -0.234487 -0.643787 -0.673471 -0.394338 0.219111 0.256897 0.213924 0.213466 0.311047 0.259417 0.242616 0.245571 0.240385 0.224853 0.185102 0.231025 0.241967
chargesum: 0.00000
title: Mulliken charges with hydrogens summed into heavy atoms:
elementType: N N N N N C C C C C C C C C
charge: -0.162313 -0.088601 -0.032568 -0.074874 0.027373 0.117808 0.163774 0.208332 0.019698 -0.103480 0.024930 0.084784 -0.032492 -0.152372
polarizability: 1.73917559e+02 -1.19830324e+00 1.51285552e+02 3.92717316e-01 1.06965973e+00 7.21712517e+01
1716.lowfreq: -9.3794 -7.3416 -0.0007 -0.0005 0.0005 5.0812 26.1044 58.7579 80.3078
frequency: 23.2185 58.6565 80.2529 95.9460 149.2899 156.1532 205.7198 208.5227 227.2048 249.0143 278.3597 311.5256 354.0212 390.5795 424.3115 517.6710 532.8304 564.4668 592.0429 600.1519 668.3587 710.3682 741.7149 765.5696 784.8241 820.0790 844.3827 872.5995 888.6513 930.8179 965.0692 1018.8966 1048.7731 1057.2647 1090.3923 1118.4444 1132.4826 1149.6583 1196.9189 1227.8201 1236.4880 1267.6162 1287.1771 1293.7080 1318.0530 1333.2404 1345.0996 1357.4563 1366.5273 1393.3073 1409.6592 1426.4791 1446.2553 1463.3293 1467.8780 1474.3184 1479.1604 1488.4219 1490.6145 1494.6257 1520.5094 1600.3603 2963.0453 2968.1295 2978.8975 2989.8789 3037.4651 3060.9731 3062.6666 3064.0931 3082.3880 3101.5095 3158.9854 3219.4030 3593.1062
redmass: 3.0826 2.7836 3.4724 2.8394 1.8950 1.3047 2.5675 2.1412 3.4167 3.4594 2.0213 5.0233 2.9438 1.2462 2.3336 4.1370 9.7943 4.1215 6.6710 4.0471 8.7746 4.1787 3.4606 1.7148 4.4449 1.7796 5.9516 2.7349 1.2909 1.4287 2.5232 2.6741 3.1425 2.1649 2.6151 1.3080 1.8874 2.6843 2.3432 1.5380 1.6118 1.6358 2.5012 4.8722 3.0446 1.5143 1.4852 1.8116 5.7609 1.2210 2.9809 2.0469 1.4754 1.1814 1.6022 1.0446 1.0750 1.1550 1.0715 1.0760 5.4115 7.1160 1.0696 1.0387 1.0353 1.0614 1.0969 1.0933 1.1025 1.0994 1.1001 1.0984 1.0917 1.0981 1.0766
irintensity: 2.6964 0.3058 0.8502 1.6876 0.1468 1.7040 0.3230 0.1555 1.3455 0.6862 2.2308 0.3268 5.5722 79.3249 9.4690 1.8799 0.1133 1.5536 9.0778 16.1878 0.0731 7.1492 3.9580 8.6415 0.0154 22.8361 13.5676 4.8955 5.1897 13.1702 0.9181 16.6462 4.1526 17.9828 1.5338 0.5379 3.0755 21.4626 19.3808 14.7968 44.7313 14.2865 0.3602 47.6712 26.5559 14.8380 0.8940 8.7379 32.5115 28.5286 103.2489 13.1514 47.9977 19.5083 20.1682 20.7885 19.2311 27.3715 26.6094 42.8750 88.0241 527.4091 43.0989 29.0066 45.7119 31.7232 2.9405 15.1850 19.9572 103.0102 44.7427 12.0938 23.9968 1.6326 44.2756
temp: 298.150 k
press: 1.00000 atm
elementType: 7 7 7 7 7 6 6 6 6 6 6 6 6 6 1 1 1 1 1 1 1 1 1 1 1 1 1
symmnumber: 1
zpe: 575965.1 jmol-1
zpe.correction: 0.219374 hartree
zpe.thermalcorrener: 0.232785 hartree
zpe.thermalcorrenthalpy: 0.233729 hartree
zpe.thermalcorrgfe: 0.178328 hartree
zpe.sumelectzpe: -623.468232 hartree
zpe.sumelectthermal: -623.454821 hartree
zpe.sumelectthermalent: -623.453877 hartree
zpe.sumelectthermalfe: -623.509278 hartree
dipole: 6.8494 6.1717 0.1953
dipole: 9.2218
quadrupole: -97.5599 -74.5720 -84.8390
quadrupole: -8.1790 -0.4284 0.1262
quadrupole: -11.9029 11.0850 0.8179 -8.1790 -0.4284 0.1262
hfenergy: -623.6876058 hartree
pointgroup: C01 [X(C9H13N5)]
dipole: 2.7376468 -2.3799042 0.0684023 debye
polarizability: 173.8181754|1.631238|151.3285545|2.2624257|-1.2873353|72.2276334 unknown
InChI: InChI=1S/C9H13N5/c1-3-4-10-8-7-9(12-5-11-8)13-6-14(7)2/h5-6,10H,3-4H2,1-2H3
charge 0 multiplicity 1
27 atoms
N  -1.123186 -1.663472 -0.048362
N  1.594899 0.068335 -0.032661
N  -3.174475 -0.622452 -0.072716
N  0.117147 1.906447 -0.054213
N  -2.333303 1.712242 -0.081426
C  -0.866776 -0.278878 -0.050483
C  2.773042 0.95496 0.001724
C  0.299865 0.548637 -0.042285
C  4.053514 0.195005 -0.399984
C  -2.155565 0.350596 -0.067203
C  -2.519464 -1.792755 -0.061177
C  -0.161533 -2.770586 -0.037493
C  4.438447 -0.955674 0.559873
C  -1.165396 2.401613 -0.077867
H  2.890628 1.393466 1.014958
H  2.583168 1.798818 -0.683549
H  4.880363 0.929659 -0.425693
H  3.942484 -0.192076 -1.43205
H  1.753637 -0.932534 0.065273
H  -2.9969 -2.77171 -0.062447
H  -0.715316 -3.723183 -0.061697
H  0.49601 -2.737884 -0.925133
H  0.452694 -2.760657 0.881983
H  4.532056 -0.589063 1.598892
H  3.695467 -1.778045 0.560448
H  5.405605 -1.402681 0.268428
H  -1.242513 3.493273 -0.08984
