program: Gaussian 09
title: 000230875
version: EM64L-G09RevD.01
frameworkgroup: C1[X(C8H12N2O4)]
method: RPBEPBE
basis: SDD
operation: Freq
keyword: #p
keyword: freq=noraman
keyword: PBEPBE/SDD
title: #p freq=noraman PBEPBE/SDD
converged: NO YES NO NO
title: Mulliken charges:
elementType: O O O O N N C C C C C C C C H H H H H H H H H H H H
charge: -0.259389 -0.259332 -0.294627 -0.294564 -0.102981 -0.102993 -0.404378 -0.400184 -0.404403 -0.400133 0.255645 0.255798 -0.289323 -0.289261 0.242952 0.258801 0.276522 0.240668 0.243034 0.258852 0.276340 0.240775 0.224585 0.251525 0.224593 0.251476
chargesum: 0.00000
title: Mulliken charges with hydrogens summed into heavy atoms:
elementType: O O O O N N C C C C C C C C
charge: -0.259389 -0.259332 -0.294627 -0.294564 -0.102981 -0.102993 0.097375 0.117006 0.097483 0.116983 0.255645 0.255798 0.186786 0.186809
polarizability: 1.18901250e+02 8.77571662e-03 1.25573521e+02 1.58839600e+01 2.45683644e-03 8.50974368e+01
1716.lowfreq: -14.8951 -4.9644 -0.0008 -0.0007 -0.0003 15.4988 54.0252 65.2230 67.2932
frequency: 54.0233 65.1335 67.2647 89.1716 100.5462 132.2374 137.9916 181.7231 183.1971 209.3698 214.6049 271.0616 294.0921 337.2379 431.7122 481.1577 490.2246 538.1796 549.8248 685.5629 701.4099 722.3059 731.4874 807.2673 808.1669 821.4014 847.6068 928.7184 930.8717 943.0230 950.2551 1010.4743 1011.8489 1033.0227 1036.9542 1081.9505 1095.0640 1100.4450 1111.2699 1122.4701 1123.8056 1129.7785 1131.4577 1139.3413 1144.6238 1155.7135 1230.7875 1279.7780 1339.8288 1355.0990 1386.9388 1392.3651 1433.3104 1437.2540 1452.1423 1454.2633 1472.2065 1475.0390 1623.2525 1632.3851 3026.0737 3028.4535 3084.2613 3084.4451 3094.1429 3094.4998 3103.3704 3103.7045 3191.9663 3192.0496 3210.3669 3210.6107
redmass: 3.9316 3.7127 4.9552 3.9888 3.3512 8.5410 8.9097 3.5035 2.8603 3.9790 3.8691 4.1648 6.7746 2.3314 4.1515 5.2323 2.5592 5.9608 5.5517 9.9984 10.0141 4.9165 5.8728 1.4014 1.0472 2.0226 4.6607 5.7804 5.5022 3.4490 2.9977 1.1539 1.1038 2.7092 3.0771 2.7416 1.4159 1.3019 2.3558 1.3695 1.3756 1.4727 1.6415 1.8102 1.4961 2.8539 1.1222 1.1082 1.5592 1.4741 2.5347 2.8158 1.1337 1.1408 1.0762 1.0752 1.2960 1.2199 9.1847 10.6198 1.0558 1.0611 1.0494 1.0494 1.0576 1.0578 1.1055 1.1077 1.1195 1.1194 1.1189 1.1189
irintensity: 1.8055 13.8598 1.0318 6.0600 0.0050 3.0736 0.5827 0.1017 0.4173 28.8624 11.9506 10.3561 28.1530 4.5948 18.3566 0.0199 3.4424 0.4978 8.0099 65.3544 0.4690 18.2447 1.3542 14.9382 37.3529 2.0912 7.6191 1.9585 12.1716 16.8433 22.0694 0.0153 2.3120 25.7118 52.7983 1.8055 17.7902 21.6343 44.7238 4.2236 6.0527 16.0059 29.8770 178.0422 4.1616 299.3806 0.8553 43.4782 4.0390 87.1887 39.9527 296.6845 89.8374 64.6864 9.4799 5.4667 19.4419 0.2366 11.9933 843.8218 10.7467 52.8903 38.3877 1.7374 49.2673 11.6945 18.7109 8.0328 4.7880 2.8561 36.5721 2.9624
temp: 298.150 k
press: 1.00000 atm
elementType: 8 8 8 8 7 7 6 6 6 6 6 6 6 6 1 1 1 1 1 1 1 1 1 1 1 1
symmnumber: 1
zpe: 529489.0 jmol-1
zpe.correction: 0.201672 hartree
zpe.thermalcorrener: 0.215824 hartree
zpe.thermalcorrenthalpy: 0.216769 hartree
zpe.thermalcorrgfe: 0.160119 hartree
zpe.sumelectzpe: -721.272062 hartree
zpe.sumelectthermal: -721.257909 hartree
zpe.sumelectthermalent: -721.256965 hartree
zpe.sumelectthermalfe: -721.313614 hartree
dipole: 0.0139 0.0933 -0.0068
dipole: 0.0945
quadrupole: -77.6537 -65.8356 -88.1142
quadrupole: -0.0118 7.0813 -0.0043
quadrupole: -0.4525 11.3656 -10.9131 -0.0118 7.0813 -0.0043
hfenergy: -721.4737333 hartree
pointgroup: C01 [X(C8H12N2O4)]
dipole: 0.0055321 -0.0366742 0.0027851 debye
dipolederiv: -0.4869151 0.0779241 0.0177709 0.3640268 -1.4462912 0.117905 -0.0611121 0.1603235 -0.3666064 -0.4846049 -0.071623 0.0183785 -0.3581216 -1.4487487 -0.1188172 -0.0602226 -0.1616889 -0.3663332 -1.0139936 -0.0105774 0.3399267 -0.0749085 -0.6110769 0.0741532 0.2989746 0.0405873 -0.6353139 -1.0173843 0.008197 0.3391818 0.0727317 -0.6103492 -0.0718665 0.2987961 -0.0390531 -0.633164 -1.061108 0.7076725 0.2654635 0.635547 -0.8059808 -0.399792 0.0896947 -0.321476 -0.509772 -1.0544585 -0.7103579 0.2614398 -0.6386197 -0.8143846 0.3996132 0.0861622 0.3196426 -0.5081336 0.2299624 -0.1909851 0.0640196 -0.1505409 0.2842775 0.0562867 0.118864 0.1035793 0.1727708 0.3947512 -0.0853758 -0.0343534 -0.09563 0.0890361 0.1216091 -0.0213823 0.0789097 0.2018818 0.2274005 0.1908826 0.0644421 0.1504007 0.2863343 -0.0554214 0.119638 -0.1021558 0.1731622 0.3937552 0.0874748 -0.0330093 0.0978981 0.0903587 -0.1215286 -0.0203096 -0.0788974 0.2018837 1.571351 -0.3513609 -0.641046 -0.5957127 1.8464881 -0.0061065 -0.4221102 -0.1643252 0.6653391 1.5701347 0.3497304 -0.6384072 0.5946215 1.8518106 0.0043694 -0.4213773 0.1642469 0.6617652 0.4026776 -0.3767814 0.0658985 -0.2271416 0.548101 -0.0408308 0.0244227 0.0638787 0.1872854 0.3988125 0.3758379 0.0657694 0.2262591 0.5521455 0.041587 0.0250407 -0.0629915 0.187436 0.0291662 0.0622014 -0.0469306 0.0712877 -0.0792437 0.0285537 -0.0741468 0.0833561 0.0822509 -0.0245326 -0.0783282 -0.0662586 -0.0365686 0.0121072 -0.0099225 -0.0040891 -0.0563596 0.0790122 0.0880996 0.0164843 -0.0530575 0.0485906 0.0767853 0.0581962 0.0143392 0.0265384 -0.0148766 -0.1352363 0.014005 0.0622757 -0.0289125 0.1157684 0.0290858 0.0146181 0.0056482 0.0545807 0.0304846 -0.0611273 -0.0468704 -0.0704406 -0.0797894 -0.0291106 -0.0737426 -0.0840282 0.0818709 -0.0248985 0.0779195 -0.0666654 0.0360278 0.0127247 0.0094021 -0.0049407 0.0563556 0.0788588 0.0876902 -0.0165002 -0.0527708 -0.0485168 0.0764606 -0.0586819 0.0147539 -0.0264942 -0.0152058 -0.1352086 -0.0154657 0.0618568 0.0276005 0.1159347 -0.0286563 0.0142539 -0.0055483 0.0548197 -0.000966 -0.0933669 -0.0346779 -0.0324531 -0.1285969 -0.0197368 -0.0288558 -0.0080829 0.1049136 0.0080911 0.0929361 0.0609711 0.009162 0.0973178 0.0667255 0.0508755 -0.0119857 -0.0215893 -0.0018291 0.0942058 -0.0347172 0.0332611 -0.127707 0.0192787 -0.0288773 0.0077084 0.1049379 0.0087588 -0.0936217 0.0613698 -0.0098479 0.0965178 -0.0662947 0.0507331 0.0123119 -0.0217743 unknown
polarizability: 119.7003235|-0.016008|125.5734398|-14.9884268|-0.0131332|84.2984444 unknown
InChI: InChI=1S/C8H12N2O4/c11-7(9-1-2-9)13-5-6-14-8(12)10-3-4-10/h1-6H2
charge 0 multiplicity 1
26 atoms
O  -1.557981 -1.369176 -0.451548
O  1.565352 -1.359534 0.449081
O  -0.277499 0.274072 -1.563894
O  0.272276 0.274978 1.559616
N  -2.328645 0.774043 -0.516145
N  2.323275 0.787999 0.517845
C  -2.215904 2.113419 0.101342
C  -2.916602 0.955324 0.832161
C  2.204619 2.127168 -0.09898
C  2.914316 0.973728 -0.828486
C  -1.287136 -0.056785 -0.885083
C  1.28554 -0.049209 0.882989
C  -0.461612 -2.353106 -0.608908
C  0.475448 -2.350738 0.605282
H  -2.80954 2.905019 -0.365935
H  -1.229649 2.40512 0.479759
H  -2.374228 0.501178 1.667787
H  -4.009126 0.9263 0.882271
H  2.79218 2.921867 0.370703
H  1.217828 2.413345 -0.480196
H  2.377261 0.51703 -1.666149
H  4.007144 0.951107 -0.875219
H  -0.982132 -3.322278 -0.6850
H  0.103155 -2.14638 -1.535602
H  1.002182 -3.316621 0.680485
H  -0.090718 -2.14857 1.532127
