program: Gaussian 09
title: 000230859
version: EM64L-G09RevD.01
frameworkgroup: C1[X(C13H12O4)]
method: RPBEPBE
basis: SDD
operation: Freq
keyword: #pfreq=noraman
keyword: PBEPBE/SDD
title: #p freq=noraman PBEPBE/SDD
converged: YES YES NO NO
title: Mulliken charges:
elementType: O O O O C C C C C C C C C C C C C H H H H H H H H H H H H
charge: -0.220205 -0.226569 -0.427912 -0.209558 -0.555644 0.175873 -0.301493 -0.366066 0.512991 0.154477 -0.498218 0.160162 -0.412654 0.184527 -0.414909 0.121607 -0.741049 0.248776 0.240075 0.231895 0.226270 0.209660 0.362252 0.229727 0.219803 0.250687 0.235288 0.244438 0.365768
chargesum: 0.00000
title: Mulliken charges with hydrogens summed into heavy atoms:
elementType: O O O O C C C C C C C C C C C C C
charge: -0.220205 -0.226569 -0.062143 -0.209558 -0.066793 0.175873 0.156672 -0.156407 0.512991 0.154477 -0.135966 0.160162 -0.182927 0.184527 -0.195106 0.121607 -0.010636
polarizability: 2.74371329e+02 -8.35854069e+00 1.67207057e+02 -3.32322253e+00 1.91349538e+00 7.57781644e+01
1716.lowfreq: -9.7121 -7.2023 -3.2152 -0.0008 0.0001 0.0007 21.2746 35.3942 48.6427
frequency: 21.1630 35.3642 48.6415 86.0244 95.6964 139.9470 168.3055 172.0719 188.9718 217.9075 252.6898 278.5878 336.0970 339.6688 358.5583 396.8256 407.7077 428.7723 469.0163 529.6078 535.6744 548.7477 578.1364 625.0553 650.8263 661.9147 687.9106 720.6870 734.3201 751.4991 796.3573 806.3162 842.1223 897.6768 912.8448 935.8983 953.9703 981.8241 990.2270 1002.8936 1015.1423 1034.4045 1056.1102 1058.8413 1115.2101 1156.7444 1167.9252 1177.3081 1190.5493 1214.2328 1243.5446 1257.9129 1283.2022 1302.3290 1337.6342 1372.1265 1378.5462 1401.7438 1427.1678 1433.2278 1448.0549 1456.3317 1485.1331 1486.7059 1572.7969 1585.1338 1614.1018 1645.1632 1667.3243 2989.1336 2996.3293 3019.0492 3059.3740 3067.2702 3084.5476 3108.1625 3108.8667 3124.2012 3135.2551 3139.2988 3561.8058
redmass: 6.0312 4.0593 4.9786 7.2118 3.8764 3.8811 3.5748 1.1327 5.3586 3.9050 4.7406 5.2585 4.1689 3.9734 6.7290 1.5207 2.1307 3.0764 7.5076 3.7149 5.4159 3.4517 4.3437 3.0175 4.6058 4.1012 6.0889 6.3550 6.6277 3.7769 6.1022 1.4850 1.7205 5.0101 1.4019 3.2027 1.5196 2.0263 4.1660 1.5014 3.6153 1.7294 1.6861 2.7123 1.7870 2.7007 1.2503 1.2300 1.4296 1.9959 3.8009 2.4959 1.4002 1.3609 1.3167 1.5495 1.8987 5.1520 1.5178 1.2770 1.0600 1.0886 2.5446 1.0987 6.8279 6.2219 7.6847 8.3505 10.1237 1.0647 1.0357 1.0640 1.0875 1.0964 1.0957 1.1057 1.0874 1.1023 1.0964 1.0942 1.0658
irintensity: 1.0891 6.8437 0.8490 1.6494 0.1207 2.0180 7.1526 0.2981 6.4756 0.6985 5.4215 0.2168 3.3613 4.9687 3.6560 80.2919 44.7864 3.8495 2.5756 26.7247 24.7328 12.7884 13.5230 1.1402 2.4778 6.7759 1.5065 16.0474 24.0804 2.8184 10.0456 37.2356 17.9745 15.7768 10.3824 19.1517 9.7160 20.8776 271.5910 47.7401 104.8228 2.1318 22.7704 22.6909 286.8863 78.0364 4.1450 28.6082 5.3234 84.6606 67.9289 59.7828 11.3570 115.9768 0.1500 1.9794 162.9032 15.2989 21.7535 10.5187 16.8441 9.3887 95.5275 1.3883 64.7979 6.4967 216.7785 81.0324 153.0983 22.5913 2.4568 67.8497 13.4319 31.7544 9.3671 32.6637 13.0097 19.4581 13.9892 47.5241 70.8339
temp: 298.150 k
press: 1.00000 atm
elementType: 8 8 8 8 6 6 6 6 6 6 6 6 6 6 6 6 6 1 1 1 1 1 1 1 1 1 1 1 1
symmnumber: 1
zpe: 577583.8 jmol-1
zpe.correction: 0.219990 hartree
zpe.thermalcorrener: 0.235594 hartree
zpe.thermalcorrenthalpy: 0.236538 hartree
zpe.thermalcorrgfe: 0.175431 hartree
zpe.sumelectzpe: -802.237694 hartree
zpe.sumelectthermal: -802.222090 hartree
zpe.sumelectthermalent: -802.221146 hartree
zpe.sumelectthermalfe: -802.282254 hartree
dipole: -0.4116 9.2779 1.0327
dipole: 9.3442
quadrupole: -67.9474 -101.7567 -99.9024
quadrupole: 1.4865 -2.1271 -2.0632
quadrupole: 21.9214 -11.8878 -10.0336 1.4865 -2.1271 -2.0632
hfenergy: -802.4576844 hartree
pointgroup: C01 [X(C13H12O4)]
dipole: -0.1185255 3.6704235 0.1708283 debye
polarizability: 267.1025628|19.1328303|167.8710308|-31.1899387|8.9478705|82.3829567 unknown
InChI: InChI=1S/C13H12O4/c1-8(14)11-7-9(2-3-12(11)15)6-10-4-5-17-13(10)16/h2-3,6-7,15H,4-5H2,1H3
charge 0 multiplicity 1
29 atoms
O  -4.134648 -2.008819 0.407319
O  -1.850828 -2.358767 0.253096
O  3.858894 0.950587 -0.317534
O  1.942775 -2.787066 0.021476
C  -4.211327 0.269641 1.20395
C  -2.78333 -0.108644 0.821224
C  -5.058914 -0.848016 0.551432
C  -1.748009 0.79603 0.823397
C  -0.311038 0.732782 0.521515
C  -2.783783 -1.55966 0.467582
C  0.447967 -0.438432 0.242511
C  1.836099 -0.390557 -0.047732
C  0.383161 1.983602 0.521733
C  2.484291 0.879968 -0.050437
C  1.753149 2.059329 0.241909
C  2.520764 -1.715728 -0.320586
C  3.869028 -1.763089 -1.021953
H  -4.330767 0.247532 2.304534
H  -4.504065 1.27324 0.85196
H  -5.90853 -1.18637 1.163508
H  -5.410075 -0.572343 -0.459194
H  -2.062302 1.815316 1.103714
H  -0.031739 -1.423114 0.250686
H  -0.168081 2.905731 0.743163
H  2.263383 3.031539 0.251492
H  4.663102 -1.38749 -0.351949
H  3.887853 -1.112789 -1.913846
H  4.081889 -2.807099 -1.300255
H  4.178482 1.885981 -0.255616
