program: Gaussian 09
title: 000230843
version: EM64L-G09RevD.01
frameworkgroup: C1[X(C9H8ClNO3)]
method: RPBEPBE
basis: SDD
operation: Freq
keyword: #p
keyword: freq=noraman
keyword: PBEPBE/SDD
title: #p freq=noraman PBEPBE/SDD
converged: YES YES NO NO
title: Mulliken charges:
elementType: Cl O O O N C C C C C C C C C H H H H H H H H
charge: -0.040869 -0.356673 -0.275656 -0.187376 -0.643134 0.094622 0.336253 -0.285245 -0.297683 -0.123399 -0.210823 0.157840 0.265747 -0.756118 0.310505 0.275045 0.262887 0.261691 0.255711 0.254092 0.370496 0.332086
chargesum: 0.00000
title: Mulliken charges with hydrogens summed into heavy atoms:
elementType: Cl O O O N C C C C C C C C C
charge: -0.040869 -0.356673 -0.275656 -0.187376 0.059448 0.094622 0.336253 0.025261 -0.022639 -0.123399 0.052064 0.157840 0.265747 0.015376
polarizability: 1.82659873e+02 -3.58628351e+00 1.34744392e+02 5.22961648e+00 1.86965056e+00 5.86524272e+01
1716.lowfreq: -4.6589 -0.0003 0.0006 0.0019 4.3996 9.3478 27.7452 53.8772 65.9256
frequency: 27.7097 53.8739 65.9125 82.7615 97.6436 149.9278 160.6726 171.2960 264.1133 290.0837 333.0069 340.9588 367.7653 419.3912 428.7589 508.5395 514.0352 552.3254 575.0573 598.0347 604.0946 657.8360 666.7465 690.9134 725.6002 764.3508 798.0489 819.6827 870.6971 933.5902 952.4264 985.4075 1039.8884 1063.9935 1081.8340 1097.4306 1149.4115 1154.2616 1176.0813 1252.7477 1332.0796 1378.3591 1385.3281 1400.7535 1452.3581 1456.0143 1457.4058 1562.9957 1580.7687 1599.9699 1626.6460 1692.0997 3004.9967 3094.8133 3143.9522 3166.2003 3171.8861 3200.9158 3484.9062 3656.7753
redmass: 8.1235 3.5997 6.5995 1.1693 4.0172 5.0434 10.2081 7.8395 8.0678 5.3044 5.2006 6.8176 6.6655 4.9743 3.2804 4.5406 3.3194 3.2564 3.6867 5.6284 1.4433 1.3899 4.5598 2.6960 5.5499 4.7739 4.6435 1.7028 6.6244 1.3934 1.3631 2.1287 1.6397 3.1840 2.6051 1.8840 3.1136 1.6101 2.8907 1.3316 3.2269 8.4209 1.2513 4.5134 1.0961 1.0472 2.3311 3.4980 2.2138 4.3689 4.1040 10.3454 1.0380 1.0963 1.1009 1.0922 1.0910 1.0958 1.0463 1.1040
irintensity: 5.2687 1.3929 5.5305 0.2631 1.6432 0.7244 2.0228 3.6071 1.0986 11.1380 14.8606 0.4557 0.3463 11.6971 9.2143 9.1055 4.0728 2.9695 17.3184 1.0780 174.9315 111.6117 23.4042 6.5940 6.5306 10.3319 91.6850 48.3099 61.3939 10.8683 5.5007 110.1636 9.5698 100.7538 75.5277 39.7362 412.1417 15.3093 4.6377 11.4893 120.7040 0.4725 58.3938 155.3516 22.9860 20.6426 84.6959 79.3853 111.5289 26.5716 221.9461 175.2948 0.8650 5.1122 7.6134 9.3636 1.0173 0.5171 66.7237 89.6448
temp: 298.150 k
press: 1.00000 atm
elementType: 17 8 8 8 7 6 6 6 6 6 6 6 6 6 1 1 1 1 1 1 1 1
symmnumber: 1
zpe: 408740.9 jmol-1
zpe.correction: 0.155681 hartree
zpe.thermalcorrener: 0.169248 hartree
zpe.thermalcorrenthalpy: 0.170192 hartree
zpe.thermalcorrgfe: 0.113635 hartree
zpe.sumelectzpe: -1087.251464 hartree
zpe.sumelectthermal: -1087.237897 hartree
zpe.sumelectthermalent: -1087.236952 hartree
zpe.sumelectthermalfe: -1087.293510 hartree
dipole: -5.5197 -1.4622 -2.1120
dipole: 6.0881
quadrupole: -74.5337 -94.6808 -91.0416
quadrupole: -10.4201 3.0117 1.6222
quadrupole: 12.2183 -7.9288 -4.2895 -10.4201 3.0117 1.6222
hfenergy: -1087.4071449 hartree
pointgroup: C01 [X(C9H8Cl1N1O3)]
dipole: -2.0723249 0.8124547 0.8846665 debye
dipolederiv: -0.8754942 -0.0441721 0.106973 -0.0222676 -0.1148446 0.0040383 0.1201292 0.0087847 -0.0765264 -1.9205372 0.591881 -0.1438018 0.7085197 -0.7352546 0.2199721 -0.2101698 0.2475028 -0.3835786 -0.696235 0.0764729 0.1014299 0.2286397 -1.0260001 -0.0704415 0.1074835 -0.0247136 -0.4004277 -0.5826504 -0.0502418 0.1353914 0.3666232 -0.6957231 0.3067973 -0.2827201 0.4065389 -0.5560391 -1.0837562 -0.0923746 0.1288955 -0.1675984 -0.4502953 0.0802382 0.1255535 0.0495371 -0.7019761 -0.1610978 -0.0977452 0.0101548 -0.1796495 -0.4125404 0.0289715 0.033058 0.0145589 0.0083291 1.1085077 -0.3334788 0.0010938 0.1119212 0.1738561 0.0362025 -0.2209618 0.1142706 0.0394275 -0.3294384 0.0481814 0.0310864 -0.1292905 -0.0590688 0.0198188 0.0185028 -0.0189488 -0.0639187 -0.1811099 -0.0403033 -0.004332 -0.1218114 -0.0295901 0.0133998 0.0646534 -0.0298567 -0.1166921 1.3350523 0.0718458 -0.2008279 0.0844938 0.0134654 -0.0172921 -0.2104442 -0.0108412 -0.0460941 -0.2342625 0.02775 0.0113324 0.0260423 0.0401464 -0.0026881 0.0285072 -0.0276578 -0.0895487 1.3675902 0.1567535 -0.3587449 0.0645864 1.4234704 -0.0084305 -0.3514869 -0.027833 0.3434885 1.8266335 -0.3832685 -0.0041353 -0.988903 1.0807163 -0.5941593 0.5486488 -0.7098661 0.74555 -0.4175776 -0.0373522 0.0978901 -0.1187584 -0.0346164 0.0671814 0.1252159 0.0390113 -0.0316535 0.1197632 0.0347151 0.0006186 0.075615 0.1300802 -0.0089862 0.0104705 0.0047413 0.1587176 0.0636821 0.059525 0.018221 0.0497701 0.0252829 -0.0094943 0.0127409 0.011627 0.153098 0.0584216 -0.0549828 0.0102662 -0.0580655 0.008003 0.0096129 0.0145837 0.0156084 0.1613897 0.008255 0.0579695 -0.0105505 0.1033416 0.0281046 0.047854 -0.0269796 0.0588383 0.1009618 0.0884544 -0.0052518 -0.033135 0.0135271 0.1340879 0.008716 -0.0017317 0.0111194 -0.059508 0.1047542 -0.0101313 0.0109238 -0.0417705 -0.0290739 -0.069341 -0.0034912 -0.0680084 0.1020124 0.1996533 0.0130732 0.0456535 -0.0364782 0.3761319 -0.0552732 0.0486044 -0.0513985 0.3539369 0.2013915 0.0111348 0.0455969 0.0315128 0.1536624 -0.0066968 0.0498335 -0.0130147 0.3590516 unknown
polarizability: 181.3364809|-0.6211548|133.4729619|-14.7834212|-8.9764181|61.2472489 unknown
InChI: InChI=1S/C9H8ClNO3/c1-5(12)14-8-3-2-6(10)4-7(8)9(11)13/h2-4H,11H2,1H3
charge 0 multiplicity 1
22 atoms
Cl 4.502889 0.421188 -0.397572
O  -1.467994 0.346491 0.552294
O  0.762535 -3.280263 0.128527
O  -2.062117 2.099027 -0.913595
N  -1.263102 -2.356585 0.768646
C  0.637685 -0.858632 0.221101
C  -0.057667 0.381002 0.285026
C  2.039997 -0.821565 0.007678
C  0.619229 1.614088 0.160177
C  2.703461 0.405256 -0.124586
C  2.013242 1.631028 -0.046773
C  0.050134 -2.25483 0.360687
C  -2.394933 1.232785 -0.091384
C  -3.789367 0.910484 0.391379
H  2.562323 -1.781263 -0.05173
H  0.068611 2.554554 0.209974
H  2.54583 2.580635 -0.146582
H  -4.489531 1.677162 0.030299
H  -3.818177 0.86095 1.492705
H  -4.104032 -0.074709 0.001582
H  -1.816458 -1.520233 0.96003
H  -1.649259 -3.292774 0.883217
