program: Gaussian 09
title: 000230830
version: EM64L-G09RevD.01
frameworkgroup: C1[X(C12H11ClO)]
method: RPBEPBE
basis: SDD
operation: Freq
keyword: #p
keyword: freq=noraman
keyword: PBEPBE/SDD
title: #p freq=noraman PBEPBE/SDD
converged: YES YES NO NO
title: Mulliken charges:
elementType: Cl O C C C C C C C C C C C C H H H H H H H H H H H
charge: -0.060418 -0.228036 -0.533619 -0.432246 0.351093 -0.497765 -0.470558 0.161650 0.337266 -0.319241 -0.372821 -0.121628 -0.217845 -0.245234 0.240518 0.227831 0.221399 0.215450 0.228824 0.251396 0.250332 0.271015 0.242801 0.237627 0.262209
chargesum: 0.00000
title: Mulliken charges with hydrogens summed into heavy atoms:
elementType: Cl O C C C C C C C C C C C C
charge: -0.060418 -0.228036 -0.065270 0.004604 0.351093 -0.017545 -0.220226 0.161650 0.337266 -0.048227 -0.130020 -0.121628 0.019782 0.016975
polarizability: 2.35231565e+02 9.39928969e+00 1.41950227e+02 -5.37809062e+00 4.23824121e+00 7.09923909e+01
1716.lowfreq: -5.7895 -0.0025 0.0010 0.0018 1.7672 3.7848 35.2499 72.1093 101.3195
frequency: 35.2231 72.0973 101.3182 114.9464 179.0740 193.8318 226.6714 249.5944 301.1018 361.9292 399.0922 416.9170 441.1540 470.3421 483.2809 505.2636 584.2838 605.8270 644.1279 688.7031 693.8123 756.3565 791.6935 833.3359 856.0606 883.2029 901.4546 909.3594 915.1070 960.3661 979.8961 980.8842 990.7371 1056.4381 1077.7143 1083.6490 1099.0007 1134.6963 1184.5073 1187.2740 1239.6575 1249.5996 1270.3545 1291.9288 1303.6957 1318.4771 1343.1827 1364.9282 1376.2370 1412.0651 1438.5096 1455.3143 1472.6099 1475.2673 1561.7846 1576.8534 1600.4070 1612.5873 2951.7948 2970.7519 2993.0816 3033.5433 3053.9987 3068.3266 3138.0339 3143.5382 3161.8008 3172.1523 3178.4167
redmass: 6.4317 3.6514 6.5571 3.2619 5.4246 5.5916 4.8965 2.0404 5.2815 5.3283 7.0982 2.9672 2.9598 3.8444 4.0559 3.6050 3.2637 4.0364 5.6894 2.0687 4.8962 2.4579 1.4443 2.7145 1.8871 1.8062 1.7010 1.3860 1.7870 2.2189 5.4924 1.4238 3.1287 2.0314 1.9520 1.7341 1.6599 1.1983 1.1422 1.5477 1.7656 1.5402 2.0453 1.3180 1.5265 1.5088 1.9011 1.7802 5.2770 3.0241 1.0882 1.1661 1.9438 1.1475 6.0480 9.4148 6.3891 6.9631 1.0664 1.0668 1.0617 1.0919 1.1014 1.0954 1.0905 1.0875 1.0933 1.0920 1.0983
irintensity: 4.4582 0.2484 2.8345 1.2172 0.8729 0.7009 2.4409 0.7061 2.5958 3.4344 8.0151 6.7139 1.2321 1.1825 3.3390 6.5166 1.9142 0.9808 0.5677 24.7131 40.9667 6.1418 52.4443 10.9473 11.2354 18.2022 6.7411 15.1318 0.6016 30.8007 12.3715 1.3711 3.2359 0.4712 17.8935 3.0974 9.7659 16.9196 3.6995 37.9684 3.6617 17.9371 109.0030 4.5663 21.9159 15.7520 42.0106 1.9502 21.8309 19.9481 14.6443 24.9638 13.5444 10.8650 43.8935 224.2801 1.5760 140.8559 16.6421 12.6582 36.1228 26.7341 40.3204 21.3967 11.5049 0.8903 7.7244 1.8349 5.5577
temp: 298.150 k
press: 1.00000 atm
elementType: 17 8 6 6 6 6 6 6 6 6 6 6 6 6 1 1 1 1 1 1 1 1 1 1 1
symmnumber: 1
zpe: 511877.4 jmol-1
zpe.correction: 0.194964 hartree
zpe.thermalcorrener: 0.207094 hartree
zpe.thermalcorrenthalpy: 0.208038 hartree
zpe.thermalcorrgfe: 0.155509 hartree
zpe.sumelectzpe: -998.157463 hartree
zpe.sumelectthermal: -998.145333 hartree
zpe.sumelectthermalent: -998.144388 hartree
zpe.sumelectthermalfe: -998.196917 hartree
dipole: -2.0710 -1.4093 1.1716
dipole: 2.7655
quadrupole: -108.7143 -82.3351 -91.1862
quadrupole: -18.9004 2.7916 2.6589
quadrupole: -14.6358 11.7434 2.8923 -18.9004 2.7916 2.6589
hfenergy: -998.3524265 hartree
pointgroup: C01 [X(C12H11Cl1O1)]
dipole: -0.7742507 0.6324248 -0.4294024 debye
dipolederiv: -0.5290646 0.3129455 0.0809803 0.4330948 -0.4655232 -0.0971881 0.1108976 -0.0971361 -0.095648 -1.0934794 0.2409396 -0.0818801 0.3595688 -0.7351068 0.0927423 -0.1526273 0.0770013 -0.3614038 -0.0724574 -0.0414097 0.0014343 -0.0455085 -0.0707641 0.0315623 0.0560066 -0.0398227 0.1590586 0.031181 0.0297335 -0.0175087 0.0064778 0.1253494 0.0308434 -0.0541518 0.0106781 0.1322023 0.7240832 0.0561672 0.0527898 -0.0620089 0.3114012 -0.0881991 -0.0187571 0.0046279 -0.0397321 -0.050564 -0.1077471 -0.0143675 -0.1447302 -0.3044852 0.0409864 -0.040767 0.0125977 0.1157759 -1.2110967 0.125841 -0.086474 -0.0021794 -0.0929833 -0.0224303 -0.0727261 -0.031882 -0.1499183 1.7809068 -0.1986025 0.1379958 0.1647196 0.8672458 -0.0729519 0.2051036 -0.0750069 0.1413104 0.0159274 -0.0524838 0.0111043 -0.1638774 0.003955 0.0445065 0.058293 0.0223467 0.0088639 -0.2641085 0.1657199 0.0422551 0.1124073 -0.1380484 -0.0120458 0.0888324 0.0082749 -0.1181037 -0.1590897 -0.0709922 -0.0403965 -0.0004135 -0.0497129 0.0377808 -0.0785391 0.0203376 -0.1303164 0.7120809 -0.5352552 -0.14377 -0.7946693 0.6613639 0.168633 -0.2222787 0.1743398 -0.0100807 0.054858 0.0067983 -0.0008944 0.1007371 0.1233008 0.0620892 0.0350636 0.053321 -0.1141366 -0.1911165 0.1296457 0.0216289 0.1837141 -0.2264574 -0.0279155 0.0427928 -0.0277559 -0.1191327 -0.0452438 0.0634318 -0.0869365 0.0637198 0.0315106 0.0459216 -0.103763 0.0659484 0.008032 0.0554 -0.0141073 0.0371408 0.0334606 -0.0138545 -0.0529943 0.0498131 -0.067922 -0.0766968 0.0326857 0.0049695 -0.0056508 0.049519 0.0677383 -0.09654 0.010985 -0.0284003 -0.1384783 0.0315547 -0.0583969 0.0096541 -0.110223 -0.1857868 0.0465863 0.0048869 0.0123144 0.083467 0.1025011 0.02732 0.0171871 -0.0300005 0.0272187 -0.0520103 -0.0237325 -0.0365713 -0.0998432 -0.1260941 -0.0115147 0.0462504 0.0187163 0.0723567 0.0124707 0.0818714 0.033599 0.0758497 0.0435551 -0.059717 0.0015405 -0.1072177 -0.0554386 0.0391433 0.0228696 0.0322845 0.1424292 0.1270383 -0.0429078 -0.0148728 -0.0508528 -0.0122381 -0.0316818 -0.0235159 -0.0343825 0.1404569 0.0249904 0.1000126 0.0349132 0.0700755 0.0272452 -0.0346825 0.0311105 -0.0230152 0.1359374 0.0421716 -0.0407851 -0.0043422 -0.0668355 -0.0735927 -0.0510868 -0.0061492 -0.0542127 0.1445526 -0.0366197 -0.0296053 0.0022188 -0.0176941 0.1053062 -0.0135396 -0.0015184 -0.0115634 0.1655547 unknown
polarizability: 233.1448363|-17.1038981|143.9500086|1.9617693|5.9567729|71.0793375 unknown
InChI: InChI=1S/C12H11ClO/c13-11-5-1-3-9(7-11)10-4-2-6-12(14)8-10/h1,3,5,7-8H,2,4,6H2
charge 0 multiplicity 1
25 atoms
Cl -4.255761 1.79534 0.469111
O  3.981151 -1.505972 0.44691
C  1.155686 1.562342 -0.28372
C  2.613151 1.695512 -0.778219
C  0.740041 0.107579 -0.080173
C  3.582322 0.888231 0.111256
C  1.698186 -0.856127 0.146491
C  3.145801 -0.571913 0.238008
C  -0.710353 -0.225512 -0.102507
C  -1.677796 0.791786 0.140786
C  -1.175563 -1.546536 -0.3681
C  -3.044948 0.469312 0.135787
C  -2.552631 -1.841565 -0.374377
C  -3.512708 -0.833541 -0.116785
H  0.471091 2.051705 -1.001251
H  1.041797 2.108629 0.677825
H  2.678083 1.323993 -1.819497
H  2.906906 2.761385 -0.794884
H  3.605485 1.321062 1.13381
H  4.618347 0.912622 -0.268816
H  1.427735 -1.903841 0.323337
H  -1.369558 1.818625 0.35368
H  -0.458111 -2.340053 -0.598453
H  -2.891472 -2.860424 -0.589075
H  -4.583684 -1.054339 -0.120442
