program: Gaussian 09
title: 000230827
version: EM64L-G09RevD.01
frameworkgroup: C1[X(C16H15BrO3)]
method: RPBEPBE
basis: SDD
operation: Freq
keyword: #p
keyword: freq=noraman
keyword: PBEPBE/SDD
title: #p freq=noraman PBEPBE/SDD
converged: YES YES NO NO
title: Mulliken charges:
elementType: Br O O O C C C C C C C C C C C C C C C C H H H H H H H H H H H H H H H
charge: 0.009933 -0.259505 -0.246440 -0.243497 0.426140 0.313829 -0.386589 -0.385512 0.352131 -0.361352 -0.360790 -0.394293 -0.380818 -0.232232 -0.223673 -0.412169 -0.241047 0.294333 -0.264235 -0.661575 0.255437 0.274702 0.284497 0.244926 0.258849 0.258610 0.227075 0.225424 0.226601 0.229025 0.238792 0.231330 0.223377 0.229676 0.249039
chargesum: 0.00000
title: Mulliken charges with hydrogens summed into heavy atoms:
elementType: Br O O O C C C C C C C C C C C C C C C C
charge: 0.009933 -0.259505 -0.246440 -0.243497 0.426140 0.313829 -0.386589 -0.130075 0.352131 -0.086650 -0.076293 -0.149366 -0.121969 -0.006808 0.002928 0.073516 -0.012022 0.294333 0.205887 0.040517
polarizability: 3.03077011e+02 -2.18451761e+01 1.87132490e+02 1.78257502e+01 1.35784471e+01 1.30726569e+02
1716.lowfreq: -5.3070 -2.3901 -0.0003 0.0002 0.0007 4.1822 7.3132 30.7442 31.5762
frequency: 5.7916 30.7360 31.5252 49.0240 58.7795 76.5474 84.7681 100.0045 131.4740 143.3998 167.7117 196.2097 215.5000 225.8998 251.6406 284.9589 304.7742 348.8339 383.9248 405.0033 407.8494 437.4930 459.5769 494.5916 532.9477 558.2458 584.5409 593.2018 615.5709 659.3161 688.2832 704.9948 714.9584 727.6186 761.4755 769.3678 808.6168 814.1068 829.1870 852.2342 874.2870 891.7593 920.9234 951.4579 973.7847 976.5494 985.1364 989.2119 991.9961 994.4546 1019.2675 1026.2749 1056.6325 1080.8600 1095.7475 1147.0205 1157.4721 1172.5781 1181.9567 1191.6320 1198.9531 1256.0975 1262.8887 1278.5401 1288.0569 1313.8588 1343.2872 1352.6223 1364.3100 1372.7837 1392.3525 1402.8463 1433.5757 1454.8940 1457.3577 1462.8596 1464.1665 1484.0863 1497.3214 1552.9791 1584.7221 1604.3960 1612.1259 1629.8915 2995.3190 3023.4893 3034.6928 3090.7871 3097.3962 3122.2148 3122.7299 3124.4798 3130.0988 3141.5691 3143.4393 3154.6359 3166.8606 3167.2522 3180.1867
redmass: 4.9423 4.6506 4.7557 4.3022 4.7157 4.9437 5.3920 4.2902 8.1175 5.1013 4.9815 2.4083 1.9128 6.3873 5.4704 3.3044 3.8441 4.9488 3.0170 3.6980 3.6159 3.5436 3.7049 4.3022 4.1922 4.9399 4.5619 3.8028 6.1160 7.3405 5.9026 1.7524 3.5016 4.9669 3.2007 1.9397 2.7621 1.9294 1.3975 1.2434 1.5056 3.6599 1.4030 1.3936 3.0861 1.7930 5.3258 5.4252 2.1848 1.3401 2.9986 2.4466 2.0015 1.6216 2.1646 1.8597 1.6621 1.0522 1.8090 1.1273 2.7485 1.6963 1.2821 1.1462 2.5545 1.4774 3.1146 1.2338 1.3330 7.2733 1.2316 3.9208 2.3185 1.1088 1.0954 2.1847 1.0485 1.0522 2.9371 7.3486 6.0861 6.8111 6.1414 8.8896 1.0360 1.0615 1.0599 1.0975 1.1027 1.1033 1.0849 1.1068 1.0878 1.0899 1.0919 1.0961 1.0994 1.0977 1.0928
irintensity: 1.0716 0.2221 0.5455 0.0360 0.8784 0.2840 2.0424 0.2876 0.6861 0.8169 0.3843 1.4346 3.5042 3.4025 2.0343 8.4842 15.2171 3.8332 6.4237 0.7341 0.2075 0.9325 11.7567 3.9016 14.6302 22.3140 16.1987 4.8948 0.1285 3.8285 0.3631 49.9597 6.8725 11.9240 9.9924 49.3822 39.9264 5.6023 34.0949 0.4562 33.5678 10.4977 0.4331 3.1255 121.4155 43.3002 15.1525 7.2940 16.4572 0.5176 154.1621 1.8340 7.4509 8.5410 20.8368 149.8260 14.5282 0.0860 236.9101 2.5990 24.5963 9.2266 134.3496 26.9385 11.9332 6.3693 28.8762 0.5550 3.7086 0.2737 24.4000 4.7758 7.0433 14.8403 9.6416 175.1051 21.4298 12.8185 33.2445 24.8811 3.6379 136.7557 5.4457 172.2718 19.2706 31.8578 23.9446 30.5988 1.9440 6.7650 3.4674 31.0561 2.2127 13.5641 18.7914 34.2289 8.0760 12.8277 0.6084
temp: 298.150 k
press: 1.00000 atm
elementType: 35 8 8 8 6 6 6 6 6 6 6 6 6 6 6 6 6 6 6 6 1 1 1 1 1 1 1 1 1 1 1 1 1 1 1
symmnumber: 1
zpe: 705496.5 jmol-1
zpe.correction: 0.268709 hartree
zpe.thermalcorrener: 0.287887 hartree
zpe.thermalcorrenthalpy: 0.288831 hartree
zpe.thermalcorrgfe: 0.216366 hartree
zpe.sumelectzpe: -856.380909 hartree
zpe.sumelectthermal: -856.361731 hartree
zpe.sumelectthermalent: -856.360787 hartree
zpe.sumelectthermalfe: -856.433252 hartree
dipole: -3.6463 -1.5248 -0.2757
dipole: 3.9619
quadrupole: -94.6884 -128.7347 -119.2686
quadrupole: -5.1523 0.6016 3.4606
quadrupole: 19.5421 -14.5041 -5.0380 -5.1523 0.6016 3.4606
hfenergy: -856.6496183 hartree
pointgroup: C01 [X(C16H15Br1O3)]
dipole: 1.3367615 -0.7832424 0.1710971 debye
polarizability: 305.4369278|6.6792764|182.8091393|21.9736071|-16.5820167|132.6900033 unknown
InChI: InChI=1S/C16H15BrO3/c1-2-19-16(18)11-20-13-8-9-14(15(17)10-13)12-6-4-3-5-7-12/h3-10H,2,11H2,1H3
charge 0 multiplicity 1
35 atoms
Br -2.470519 3.026127 -0.315906
O  2.364364 1.310388 0.708194
O  5.183756 0.050863 -0.089846
O  3.601603 -1.658997 0.065284
C  -1.708442 0.177903 0.077841
C  -3.118845 -0.2614 -0.146091
C  -1.238001 1.518844 -0.003764
C  -0.728337 -0.804646 0.394892
C  1.044314 0.848178 0.516192
C  0.108485 1.863185 0.208095
C  0.63102 -0.500443 0.60949
C  -3.751021 -1.104927 0.807309
C  -3.835973 0.08992 -1.321176
C  -5.065968 -1.575676 0.599438
C  -5.149793 -0.38184 -1.530273
C  3.330074 0.427141 1.381158
C  -5.771911 -1.214802 -0.571089
C  4.021206 -0.524222 0.396854
C  5.960406 -0.744904 -1.099111
C  6.91578 -1.714318 -0.399275
H  -1.048465 -1.851453 0.433651
H  0.446494 2.901158 0.163178
H  1.349468 -1.306167 0.784673
H  -3.215079 -1.371156 1.725917
H  -3.358843 0.721508 -2.077212
H  4.073566 1.110533 1.816776
H  2.833273 -0.165644 2.170662
H  -5.53982 -2.216005 1.351929
H  -5.685448 -0.103639 -2.444871
H  -6.7930 -1.577249 -0.734402
H  5.242366 -1.278749 -1.745758
H  6.494204 0.027546 -1.674134
H  7.538116 -2.229047 -1.15436
H  7.587761 -1.177049 0.291783
H  6.356807 -2.480161 0.163851
