program: Gaussian 09
title: 000000804
version: EM64L-G09RevD.01
frameworkgroup: C1[X(C10H12N4O5)]
method: RPBEPBE
basis: SDD
operation: Freq
keyword: #p
keyword: freq=noraman
keyword: PBEPBE/SDD
title: #p freq=noraman PBEPBE/SDD
converged: YES YES NO NO
title: Mulliken charges:
elementType: O O O O O N N N N C C C C C C C C C C H H H H H H H H H H H H
charge: -0.251778 -0.442364 -0.468511 -0.498626 -0.201034 -0.180487 -0.367515 -0.026280 -0.005667 -0.168943 -0.151093 -0.167377 -0.035014 -0.389176 0.370054 -0.244566 -0.139043 0.030324 -0.241160 0.294027 0.267476 0.244816 0.256520 0.252726 0.235920 0.354255 0.313328 0.389984 0.347436 0.381045 0.240724
chargesum: 0.00000
title: Mulliken charges with hydrogens summed into heavy atoms:
elementType: O O O O O N N N N C C C C C C C C C C
charge: -0.251778 -0.088109 -0.078527 -0.117581 -0.201034 -0.180487 -0.020079 -0.026280 -0.005667 0.098533 0.142934 0.077440 0.221506 0.099470 0.370054 0.068761 -0.139043 0.030324 -0.000436
polarizability: 1.89781991e+02 1.43031685e+01 1.29141833e+02 7.60155088e+00 -1.84697919e+01 1.22105583e+02
1716.lowfreq: -15.0638 -7.5478 -1.4780 -0.0003 0.0003 0.0005 5.8043 33.1638 66.6325
frequency: -13.7717 33.1233 66.6174 84.7742 108.5997 116.6301 162.2123 184.4431 205.3582 229.9195 263.9873 268.1764 286.4017 301.4697 321.2614 337.4842 371.5253 397.6730 416.5336 449.1416 485.6964 495.1544 546.5058 554.2131 566.8578 596.3557 632.2009 659.8535 679.7262 707.2110 723.2449 744.0641 765.3232 780.4794 795.3758 804.3872 861.0939 868.2447 889.0373 925.1340 929.9639 954.5205 967.2618 983.8802 1007.6556 1013.8045 1041.8361 1075.5107 1082.0840 1095.6262 1140.6527 1171.0629 1181.5540 1197.8559 1207.5063 1228.3150 1260.3466 1271.4845 1277.1297 1298.1294 1305.7657 1316.9180 1333.8073 1338.2785 1345.9341 1360.1847 1373.8164 1403.5881 1420.4362 1424.4975 1476.2095 1515.4072 1529.1963 1597.6919 1636.8351 2987.7247 3002.9333 3037.3993 3055.6268 3060.0602 3080.8124 3122.9945 3249.7145 3338.2834 3532.1287 3577.9871 3605.1217
redmass: 6.0269 6.2111 6.7104 5.8760 6.8676 6.9637 3.8188 5.7755 5.6377 5.4898 3.7136 1.9826 3.2322 3.1680 4.1547 1.4951 2.9540 5.2791 6.8740 5.4318 10.5901 3.6481 4.8342 1.4637 3.6083 8.3105 3.9735 11.7440 7.6350 1.2311 2.8031 4.9607 2.4699 3.9275 3.3357 3.4784 7.7996 4.5898 1.4628 3.5478 7.4498 7.1543 3.2026 2.6657 4.7675 3.8856 2.9076 3.0175 2.6528 2.1188 3.2460 1.3488 1.1373 1.4494 1.8584 1.2362 1.7904 1.2600 1.3478 1.3239 1.4884 2.7818 1.8456 1.4761 1.5538 1.4741 1.3563 1.5959 2.0001 2.0684 1.0810 5.4495 4.9669 6.9599 12.4446 1.0860 1.0564 1.0861 1.0869 1.0965 1.1018 1.0926 1.0997 1.0659 1.0795 1.0665 1.0670
irintensity: 0.9244 8.9886 6.4384 1.2101 6.3378 2.1085 4.6560 5.3386 15.0637 19.2444 5.8331 102.5326 17.6392 36.7417 18.8600 121.0510 21.9034 6.1456 8.2954 7.1513 2.6949 9.8880 3.0712 95.6610 19.1934 4.0317 11.1554 2.9251 25.7189 136.0607 75.3719 16.0242 30.4415 25.2080 20.8508 53.4154 8.8930 28.8374 11.7843 86.1743 46.9440 38.7748 67.9755 16.9006 157.6484 12.4233 31.8300 15.5668 3.1184 43.0595 17.1716 63.5199 13.4876 39.1975 66.2394 17.8918 1.4790 16.0047 17.9816 3.3023 25.9692 22.5916 17.8748 6.8992 22.6329 11.6164 35.9339 2.6770 31.9469 8.9440 5.5290 97.2827 253.4652 63.6030 409.7394 50.3870 24.2771 17.4201 9.4791 9.3960 49.4004 20.9677 14.3670 195.1197 46.8402 17.2264 18.4689
temp: 298.150 k
press: 1.00000 atm
elementType: 8 8 8 8 8 7 7 7 7 6 6 6 6 6 6 6 6 6 6 1 1 1 1 1 1 1 1 1 1 1 1
symmnumber: 1
zpe: 604718.4 jmol-1
zpe.correction: 0.230325 hartree
zpe.thermalcorrener: 0.246116 hartree
zpe.thermalcorrenthalpy: 0.247060 hartree
zpe.thermalcorrgfe: 0.187299 hartree
zpe.sumelectzpe: -981.920430 hartree
zpe.sumelectthermal: -981.904639 hartree
zpe.sumelectthermalent: -981.903695 hartree
zpe.sumelectthermalfe: -981.963456 hartree
dipole: -11.0124 -3.2011 4.2660
dipole: 12.2360
quadrupole: -142.6193 -103.4071 -105.8721
quadrupole: -19.7289 10.1496 11.0277
quadrupole: -25.3198 13.8924 11.4274 -19.7289 10.1496 11.0277
hfenergy: -982.1507548 hartree
pointgroup: C01 [X(C10H12N4O5)]
dipole: 4.2319424 2.1087284 0.9048216 debye
polarizability: 179.379319|23.4542073|138.8511669|-20.9704878|12.1593862|122.7989216 unknown
InChI: InChI=1S/C10H12N4O5/c15-1-4-6(16)7(17)10(19-4)14-3-13-5-8(14)11-2-12-9(5)18/h2-4,6-7,10-11,15-17H,1H2
charge 0 multiplicity 1
31 atoms
O  1.597065 1.262082 0.885119
O  2.4687 2.785723 -1.55922
O  3.014944 -0.836564 -1.47033
O  3.872801 -1.69077 0.904581
O  -4.022221 -2.150576 0.010309
N  -0.088125 0.341379 -0.599461
N  -1.693722 1.105835 1.165393
N  -1.255854 -1.501881 -1.305816
N  -3.691194 -0.243768 1.366531
C  2.052577 1.38573 -1.465875
C  0.925013 1.393373 -0.417225
C  3.150953 0.47594 -0.847802
C  2.859369 0.487427 0.692728
C  2.667108 -0.917104 1.293432
C  -1.258167 0.272861 0.150962
C  -0.137588 -0.787772 -1.468486
C  -1.984758 -0.848419 -0.287641
C  -3.28641 -1.179335 0.314793
C  -2.939777 0.7692 1.72901
H  0.427472 2.378381 -0.402333
H  1.743519 0.984124 -2.448327
H  4.158055 0.894364 -1.045109
H  3.639743 1.038419 1.242559
H  1.755692 -1.389621 0.881492
H  2.586846 -0.845914 2.393155
H  3.187626 2.870177 -2.234605
H  0.687131 -1.031358 -2.132684
H  3.514186 -1.487421 -0.891883
H  -1.110268 1.844383 1.565188
H  3.918435 -2.539591 1.408131
H  -3.271351 1.435794 2.535113
