program: Gaussian 09
title: 000018395
version: EM64L-G09RevD.01
frameworkgroup: C1[X(C9H19NO2)]
method: RPBEPBE
basis: SDD
operation: Freq
keyword: #p
keyword: freq=noraman
keyword: PBEPBE/SDD
title: #p freq=noraman PBEPBE/SDD
converged: YES YES NO NO
title: Mulliken charges:
elementType: O O N C C C C C C C C C H H H H H H H H H H H H H H H H H H H
charge: -0.294695 -0.283979 -0.618727 0.329363 -0.397881 -0.407480 -0.731301 -0.731354 -0.722365 -0.387790 -0.276506 0.290188 0.192227 0.192235 0.206258 0.206277 0.215335 0.208799 0.208787 0.208759 0.208730 0.215545 0.209315 0.209278 0.209762 0.209365 0.209406 0.224638 0.224611 0.334381 0.338819
chargesum: 0.00000
title: Mulliken charges with hydrogens summed into heavy atoms:
elementType: O O N C C C C C C C C C
charge: -0.294695 -0.283979 0.054473 0.329363 -0.013420 0.005056 -0.098380 -0.098320 -0.094010 0.030981 0.172742 0.290188
polarizability: 1.43823045e+02 -1.66693859e+00 1.05202932e+02 1.71727552e-02 -3.57013888e-03 8.85734082e+01
1716.lowfreq: -5.9197 -0.0006 -0.0001 0.0005 4.0163 14.8020 23.8605 32.7211 55.2081
frequency: 23.5605 31.9260 55.1769 68.9389 98.9079 127.1116 152.6755 167.0538 189.9648 204.1516 247.0947 250.2874 268.2130 316.2128 344.3171 373.3328 397.2272 425.5328 469.3416 486.5461 511.4440 518.2319 619.5748 705.9961 736.8421 737.2050 782.3827 830.3515 895.4205 902.1880 924.1095 924.1789 933.7237 997.0267 1003.0576 1005.6806 1052.9519 1055.7064 1062.3805 1081.5520 1098.2255 1160.3206 1202.6477 1226.3852 1247.9704 1264.0223 1266.6418 1284.9642 1296.2258 1313.7400 1323.6800 1355.5491 1367.7921 1369.6327 1386.5594 1394.3560 1451.2631 1457.9919 1465.1454 1467.0756 1468.7108 1478.0937 1482.2349 1482.5898 1490.6723 1494.6196 1586.7021 1682.7236 2946.3618 2961.6053 2965.0077 2970.7601 2974.0214 2988.7493 2995.7043 3000.2568 3024.8029 3045.9580 3056.8060 3058.7418 3061.0581 3065.9145 3066.6184 3070.4962 3074.4290 3559.8056 3719.0078
redmass: 5.3142 3.4612 4.1674 2.2801 2.2607 1.8402 4.0025 3.2887 4.9078 1.1013 1.0462 1.0574 3.1137 2.0656 2.5223 3.0829 2.0357 2.6773 2.6017 1.1761 2.9511 1.0549 5.9971 10.9292 2.8795 1.1801 1.1734 5.1493 1.3655 2.2183 1.6259 1.5966 1.2143 1.2895 3.7679 2.2643 2.3890 2.4328 2.7752 1.4103 2.7180 1.3088 1.9781 1.7057 1.9750 1.9979 1.3405 1.1461 2.1327 1.2835 1.6386 1.5286 1.2204 1.2120 1.6765 1.2256 1.0755 1.0517 1.0535 1.0462 1.0738 1.0913 1.0603 1.0596 1.0871 1.0663 1.2192 7.2855 1.0584 1.0346 1.0349 1.0406 1.0542 1.0596 1.0996 1.0567 1.1018 1.1051 1.1003 1.0997 1.0999 1.0989 1.0984 1.0981 1.1078 1.0444 1.1058
irintensity: 2.8316 1.0752 1.0884 0.0161 3.1821 0.0062 4.6560 8.1335 1.7938 0.0158 0.1874 0.0221 4.6435 0.0311 3.0502 6.0828 0.0276 0.6983 7.1549 306.6642 0.4162 26.7768 0.9578 32.4438 1.8572 6.5328 0.0018 26.9224 0.0318 6.9803 1.6021 1.3547 0.0525 0.0039 92.6581 45.3417 3.5301 64.6128 19.0554 0.1361 10.1060 2.4613 2.7332 1.8791 24.8261 11.9039 0.1216 1.1649 398.2755 4.1141 73.7899 8.1453 19.1462 25.2538 37.5675 6.5039 0.4861 0.0185 0.3582 0.7942 0.6792 0.2644 10.2539 14.1576 8.2477 29.5329 105.3580 367.2026 28.9225 39.6524 43.9449 6.9681 21.8203 19.7971 8.3439 48.8769 14.1345 12.7801 1.0198 0.7610 34.2194 36.3071 97.7588 104.2167 91.1873 59.3111 47.8289
temp: 298.150 k
press: 1.00000 atm
elementType: 8 8 7 6 6 6 6 6 6 6 6 6 1 1 1 1 1 1 1 1 1 1 1 1 1 1 1 1 1 1 1
symmnumber: 1
zpe: 712676.6 jmol-1
zpe.correction: 0.271444 hartree
zpe.thermalcorrener: 0.286867 hartree
zpe.thermalcorrenthalpy: 0.287811 hartree
zpe.thermalcorrgfe: 0.227565 hartree
zpe.sumelectzpe: -558.581265 hartree
zpe.sumelectthermal: -558.565842 hartree
zpe.sumelectthermalent: -558.564898 hartree
zpe.sumelectthermalfe: -558.625144 hartree
dipole: -0.4111 -2.5734 0.0018
dipole: 2.6061
quadrupole: -66.9156 -78.4575 -75.9238
quadrupole: -14.9099 0.0141 -0.0046
quadrupole: 6.8500 -4.6918 -2.1582 -14.9099 0.0141 -0.0046
hfenergy: -558.8527087 hartree
pointgroup: C01 [X(C9H19N1O2)]
dipole: -0.1753879 -1.0101611 -0.0078335 debye
polarizability: 143.7710598|-2.1872244|105.253803|0.0149663|0.1354363|88.5745215 unknown
InChI: InChI=1S/C9H19NO2/c1-9(2,3)6-4-5-7-12-8(10)11/h4-7,10H2,1-3H3
charge 0 multiplicity 1
31 atoms
O  2.879706 -0.595151 -0.002995
O  4.265876 1.315366 0.013874
N  5.136978 -0.866874 -0.003367
C  -3.492483 0.038698 0.001069
C  -2.106528 -0.681848 -0.00826
C  -0.854848 0.225221 0.002631
C  -3.659663 0.898693 1.282248
C  -3.656715 0.936188 -1.254601
C  -4.597673 -1.053037 -0.016319
C  0.453936 -0.600631 -0.004194
C  1.689986 0.299157 0.004288
C  4.121739 0.067046 0.002703
H  -2.060932 -1.358164 0.871771
H  -2.061641 -1.335573 -0.905245
H  -0.868986 0.878027 0.898057
H  -0.866964 0.89603 -0.879417
H  -2.935067 1.732703 1.316058
H  -3.517363 0.285388 2.192696
H  -4.674481 1.337323 1.324788
H  -3.514062 0.349563 -2.182385
H  -4.670734 1.377658 -1.285583
H  -2.930496 1.769414 -1.262401
H  -4.51979 -1.712694 0.8690
H  -4.517165 -1.686215 -0.920519
H  -5.605017 -0.595322 -0.010991
H  0.483625 -1.251333 -0.899606
H  0.482795 -1.267038 0.879608
H  1.732698 0.95516 -0.885137
H  1.731856 0.939419 0.905176
H  4.923322 -1.860956 -0.011419
H  6.098391 -0.539617 0.000672
