program: Gaussian 09
title: 000230793
version: EM64L-G09RevD.01
frameworkgroup: C1[X(C15H16O2)]
method: RPBEPBE
basis: SDD
operation: Freq
keyword: #pfreq=noraman
keyword: PBEPBE/SDD
title: #p freq=noraman PBEPBE/SDD
converged: YES YES NO NO
title: Mulliken charges:
elementType: O O C C C C C C C C C C C C C C C H H H H H H H H H H H H H H H H
charge: -0.263276 -0.221648 -0.193395 0.235525 0.261425 0.075128 0.186734 -0.408339 0.163621 -0.708690 -0.704718 -0.386064 -0.398758 -0.393934 -0.267761 -0.236707 -0.531811 0.242628 0.269954 0.239468 0.220084 0.215926 0.216892 0.247445 0.208452 0.248588 0.245595 0.274712 0.229113 0.231616 0.247368 0.226795 0.228029
chargesum: 0.00000
title: Mulliken charges with hydrogens summed into heavy atoms:
elementType: O O C C C C C C C C C C C C C C C
charge: -0.263276 -0.221648 0.049234 0.235525 0.261425 0.075128 0.186734 -0.138386 0.163621 -0.033211 -0.031929 -0.137476 -0.153163 -0.119222 -0.038648 -0.005091 0.170382
polarizability: 2.35858277e+02 9.81675515e-01 2.03241491e+02 -9.91951847e+00 4.72150553e+00 9.46957604e+01
1716.lowfreq: -11.0652 -8.3260 -0.0006 -0.0003 -0.0002 8.6347 37.6273 66.2487 78.6757
frequency: 37.5627 66.1976 78.6606 97.2115 128.7335 160.2343 179.8015 191.0342 193.8672 219.1097 232.8686 243.2263 252.6020 286.2583 317.6846 344.3723 366.3874 418.3197 432.8182 463.4176 475.0094 512.0664 574.4615 606.2552 618.6054 650.2636 693.5079 699.5845 736.7085 779.6610 785.2996 804.1485 830.2680 857.2361 884.2085 916.3589 928.5766 953.4393 960.8579 965.5248 972.5725 997.5527 1027.8870 1055.3642 1075.9564 1089.4887 1100.6102 1114.3730 1148.7357 1157.8744 1170.0498 1179.7568 1196.0604 1236.0584 1244.5051 1280.7150 1317.9101 1330.0817 1360.0276 1370.1402 1382.7279 1391.8019 1413.7498 1433.7231 1439.1327 1457.1000 1461.7506 1468.0010 1471.8491 1473.5428 1475.5485 1490.1765 1519.6657 1553.4743 1578.7356 1594.3805 1626.3650 2968.7526 2977.8897 2980.0238 3029.8211 3060.6698 3068.0521 3076.0996 3089.4946 3095.7529 3131.1755 3131.4458 3148.3426 3150.3000 3170.4137 3172.9478 3178.9929
redmass: 3.9603 3.8365 3.1551 3.3986 4.1102 3.8871 3.6600 2.3731 1.2812 1.9957 1.1517 1.7380 3.1822 2.6712 5.9436 4.2366 3.5954 3.3279 3.3529 6.0292 3.4700 5.7067 4.9283 4.1546 4.2117 3.5191 3.5042 4.5741 3.7667 1.7022 3.3828 3.1528 1.5945 2.9990 1.6707 3.6483 1.2006 1.8894 1.7231 2.1816 1.3880 1.3257 3.0336 2.4243 4.1597 1.5745 2.7545 1.2593 1.4413 1.5621 1.8811 1.1078 1.5151 2.0216 2.4787 1.7560 1.2679 1.7283 4.3877 1.1985 1.8256 1.3500 9.0506 1.4681 2.0566 2.0936 1.0474 1.0508 1.0502 1.0959 1.0558 1.0625 3.9072 7.1904 6.1622 7.3271 6.6317 1.0324 1.0354 1.0347 1.0846 1.1043 1.0990 1.0997 1.1006 1.0998 1.0995 1.0870 1.0884 1.0912 1.0947 1.0934 1.0977
irintensity: 2.1096 2.4988 0.8916 1.7706 7.5584 1.3452 0.8434 3.8105 0.7085 0.7881 2.1146 2.2234 1.4630 3.5305 2.9712 0.5541 0.1343 2.8039 11.7472 2.7910 1.8400 2.5982 2.5750 17.2054 3.6449 1.5006 4.8016 9.0302 0.6462 73.2637 24.7105 0.7748 37.9111 2.3290 0.2594 20.3041 4.6410 5.2423 2.5302 11.9539 1.8828 0.4941 42.7317 99.2743 54.9630 18.5845 0.5804 0.0987 3.3498 4.0817 3.5598 1.0123 47.8197 131.6376 190.5546 1.0906 13.3273 26.2045 36.3132 15.8196 41.6129 21.9930 4.3283 12.1896 11.1779 31.3371 8.5613 14.3887 4.6404 34.9936 17.0261 19.1614 81.5959 169.3118 112.9123 36.6653 6.3280 71.4783 37.9077 28.4006 11.4221 39.8701 37.6921 47.2790 2.4366 38.4734 14.9359 10.8237 1.8384 17.0945 13.2239 10.5689 14.8822
temp: 298.150 k
press: 1.00000 atm
elementType: 8 8 6 6 6 6 6 6 6 6 6 6 6 6 6 6 6 1 1 1 1 1 1 1 1 1 1 1 1 1 1 1 1
symmnumber: 1
zpe: 705976.3 jmol-1
zpe.correction: 0.268892 hartree
zpe.thermalcorrener: 0.284913 hartree
zpe.thermalcorrenthalpy: 0.285857 hartree
zpe.thermalcorrgfe: 0.225808 hartree
zpe.sumelectzpe: -730.408326 hartree
zpe.sumelectthermal: -730.392306 hartree
zpe.sumelectthermalent: -730.391362 hartree
zpe.sumelectthermalfe: -730.451411 hartree
dipole: -3.1550 0.4765 1.8623
dipole: 3.6945
quadrupole: -88.1240 -91.2134 -106.9275
quadrupole: 14.9798 4.2330 -4.0922
quadrupole: 7.2976 4.2083 -11.5059 14.9798 4.2330 -4.0922
hfenergy: -730.6772186 hartree
pointgroup: C01 [X(C15H16O2)]
dipole: -1.279686 0.0614188 -0.6865342 debye
polarizability: 236.1270566|-4.1708339|196.1318871|3.7946741|27.8374836|101.5365847 unknown
InChI: InChI=1S/C15H16O2/c1-10(2)15(16)13-8-9-14(17-3)12-7-5-4-6-11(12)13/h4-10H,1-3H3
charge 0 multiplicity 1
33 atoms
O  -3.508742 0.854737 0.128679
O  2.809971 1.333774 1.398908
C  3.075776 -0.000571 -0.608453
C  0.72413 0.577534 0.472711
C  -0.062771 -0.578416 0.086761
C  2.22536 0.636334 0.513356
C  -1.502725 -0.449537 -0.018904
C  0.059688 1.768337 0.812954
C  -2.120932 0.821182 0.284293
C  3.715491 1.160138 -1.421779
C  4.175042 -0.91418 -0.01036
C  0.500926 -1.882041 -0.126545
C  -1.349487 1.909147 0.715608
C  -2.30084 -1.57866 -0.387957
C  -0.298016 -2.97383 -0.476706
C  -1.709425 -2.821481 -0.625017
C  -4.203671 2.10783 0.441971
H  2.428236 -0.579111 -1.290549
H  0.667892 2.617473 1.141551
H  4.353087 1.775259 -0.762972
H  2.94534 1.813948 -1.870803
H  4.33769 0.750669 -2.238393
H  4.842691 -1.286809 -0.80829
H  4.77706 -0.341989 0.717085
H  3.751137 -1.789337 0.517498
H  1.572413 -2.036201 0.023822
H  -1.808651 2.869366 0.965288
H  -3.383255 -1.445934 -0.464864
H  0.160859 -3.957394 -0.626509
H  -2.326301 -3.682524 -0.903556
H  -5.265997 1.90191 0.247382
H  -3.854137 2.930288 -0.210739
H  -4.062635 2.386385 1.503531
