program: Gaussian 09
title: 000232058
version: EM64L-G09RevD.01
frameworkgroup: C1[X(C10H12N2O4)]
method: RPBEPBE
basis: SDD
operation: Freq
keyword: #p
keyword: freq=noraman
keyword: PBEPBE/SDD
title: #p freq=noraman PBEPBE/SDD
converged: NO YES NO NO
title: Mulliken charges:
elementType: O O O O N N C C C C C C C C C C H H H H H H H H H H H H
charge: -0.313388 -0.313389 -0.274011 -0.274011 -0.453976 -0.453975 0.495098 0.495098 -0.450911 -0.340230 -0.340230 -0.450911 0.260133 0.260133 -0.493898 -0.493898 0.224062 0.299665 0.299666 0.224061 0.331452 0.331452 0.241634 0.232734 0.241636 0.241634 0.232734 0.241637
chargesum: 0.00000
title: Mulliken charges with hydrogens summed into heavy atoms:
elementType: O O O O N N C C C C C C C C C C
charge: -0.313388 -0.313389 -0.274011 -0.274011 -0.122524 -0.122523 0.495098 0.495098 -0.226850 -0.040564 -0.040564 -0.226850 0.260133 0.260133 0.222106 0.222107
polarizability: 2.65815096e+02 1.05918308e+00 1.27757801e+02 -3.82546867e-03 1.04884531e-03 6.53125351e+01
1716.lowfreq: -0.0012 -0.0008 0.0006 3.4137 7.4128 24.7887 30.2678 57.4274 70.9179
frequency: 30.2678 57.4274 70.8488 77.0738 78.3554 89.2931 94.0539 134.1834 134.2638 161.5940 210.6535 223.1322 246.3170 312.5050 332.3104 378.8239 381.3056 397.9426 413.3984 528.6851 596.5650 626.3380 637.8288 638.8969 660.1223 685.0614 696.8971 697.5852 722.4329 801.0422 834.6694 844.8878 848.0586 891.4923 904.7071 965.6085 977.4175 1002.2615 1029.6867 1036.7497 1121.7078 1121.7144 1132.2581 1145.9049 1148.7643 1173.0363 1173.0468 1198.2566 1250.2275 1275.6993 1326.3819 1368.9225 1421.2832 1426.0378 1429.8144 1452.4357 1452.4366 1469.5116 1469.7321 1499.3551 1508.3160 1532.2560 1602.1140 1637.1825 1664.5874 1669.9397 2998.2438 2998.3940 3097.7129 3097.7281 3118.2760 3120.5913 3142.3075 3142.3192 3188.3840 3190.3998 3544.0596 3544.3074
redmass: 4.6157 7.1238 3.9537 4.7468 3.2125 1.2298 1.3378 4.7484 2.7152 3.5972 5.2278 7.5776 4.5242 4.2163 8.1260 5.5257 5.1232 5.5753 3.0726 2.4604 6.0054 7.0359 1.3046 1.2784 6.2483 6.2689 5.9802 5.8825 3.7852 5.2749 1.2742 6.1396 1.6429 8.2410 6.9926 1.3158 1.3237 3.4841 8.0620 5.1103 1.2538 1.2539 1.3394 1.6317 1.5849 2.7979 2.5291 1.1300 1.8039 2.2108 1.5586 4.4304 2.9905 1.1547 1.3053 1.0493 1.0493 1.0656 1.0599 2.3084 2.1338 2.5476 4.8314 6.3846 7.9252 8.4596 1.0300 1.0301 1.1047 1.1047 1.0908 1.0912 1.1040 1.1040 1.0939 1.0947 1.0761 1.0761
irintensity: 0.2728 9.6433 0.0000 2.1629 0.0000 4.4628 0.0000 0.0000 9.0597 0.0000 11.6889 0.0000 24.5437 0.0000 45.2724 0.0000 0.0000 1.5929 0.0327 46.0243 0.0000 0.0000 0.0016 96.6277 36.7107 0.0000 0.0001 94.1212 0.0000 3.1005 0.0000 0.0000 130.4113 36.6733 0.0000 0.0000 2.2561 34.9833 0.0000 344.0818 0.4676 0.0041 58.1647 478.3008 0.0000 0.3271 465.8984 0.0000 9.4405 0.0000 0.0000 355.6703 54.7550 0.0000 93.2819 7.8503 19.0189 0.0000 70.9231 0.0000 8.5791 1232.1792 0.0000 0.0000 557.4256 0.0000 107.9289 0.0024 0.0248 60.1086 36.1469 0.0002 36.1270 2.2695 6.4452 0.0000 67.3803 0.0518
temp: 298.150 k
press: 1.00000 atm
elementType: 8 8 8 8 7 7 6 6 6 6 6 6 6 6 6 6 1 1 1 1 1 1 1 1 1 1 1 1
symmnumber: 1
zpe: 564065.5 jmol-1
zpe.correction: 0.214841 hartree
zpe.thermalcorrener: 0.231018 hartree
zpe.thermalcorrenthalpy: 0.231963 hartree
zpe.thermalcorrgfe: 0.169617 hartree
zpe.sumelectzpe: -797.503927 hartree
zpe.sumelectthermal: -797.487750 hartree
zpe.sumelectthermalent: -797.486806 hartree
zpe.sumelectthermalfe: -797.549151 hartree
dipole: 0.0000 0.0000 -0.0001
dipole: 0.0001
quadrupole: -64.5615 -91.8526 -96.0239
quadrupole: -13.0377 -0.0007 0.0004
quadrupole: 19.5845 -7.7066 -11.8779 -13.0377 -0.0007 0.0004
hfenergy: -797.7187686 hartree
pointgroup: C01 [X(C10H12N2O4)]
dipole: 0.0000021 -0.0000001 -0.0000433 debye
polarizability: 265.815199|1.0524728|127.7576986|0.0038254|-0.001049|65.3125351 unknown
InChI: InChI=1S/C10H12N2O4/c1-15-9(13)11-7-3-5-8(6-4-7)12-10(14)16-2/h3-6,11-12H,1-2H3
charge 0 multiplicity 1
28 atoms
O  -5.008108 0.734487 -0.00015
O  5.008143 -0.734409 0.000069
O  -3.915448 -1.355907 -0.000106
O  3.915484 1.355985 0.000018
N  -2.751695 0.71522 -0.000208
N  2.75173 -0.715141 -0.000097
C  -1.385674 0.320049 -0.000174
C  1.38571 -0.31997 -0.000116
C  -0.401725 1.342735 -0.00018
C  0.971783 1.037832 -0.000156
C  -0.971748 -1.037753 -0.00014
C  0.40176 -1.342656 -0.000108
C  -3.86875 -0.10012 -0.00016
C  3.868785 0.100198 -0.000015
C  -6.294665 0.011963 -0.000119
C  6.294701 -0.011884 0.000138
H  -0.710248 2.396157 -0.000207
H  1.718997 1.83362 -0.000155
H  -1.718961 -1.833541 -0.000135
H  0.710284 -2.396079 -0.000075
H  -2.950944 1.717826 -0.000244
H  2.95098 -1.717748 -0.000107
H  -6.382142 -0.621868 -0.899349
H  -7.059498 0.801612 -0.00011
H  -6.382107 -0.621854 0.899123
H  6.382228 0.621904 -0.899117
H  7.059533 -0.801533 0.000227
H  6.382092 0.621976 0.899355
