program: Gaussian 09
title: 000232036
version: EM64L-G09RevD.01
frameworkgroup: C1[X(C12H16O2)]
method: RPBEPBE
basis: SDD
operation: Freq
keyword: #pfreq=noraman
keyword: PBEPBE/SDD
title: #p freq=noraman PBEPBE/SDD
converged: YES YES NO NO
title: Mulliken charges:
elementType: O O C C C C C C C C C C C C H H H H H H H H H H H H H H H H
charge: -0.280812 -0.235916 0.036732 0.421808 -0.693870 -0.761951 0.248376 -0.366079 -0.398664 -0.249195 -0.241736 -0.242723 -0.266346 -0.661055 0.240962 0.212549 0.219393 0.216126 0.247221 0.225884 0.250929 0.250396 0.224305 0.224384 0.228338 0.220192 0.235084 0.216770 0.255291 0.223605
chargesum: 0.00000
title: Mulliken charges with hydrogens summed into heavy atoms:
elementType: O O C C C C C C C C C C C C
charge: -0.280812 -0.235916 0.036732 0.421808 -0.020966 -0.072719 0.248376 -0.115150 -0.148268 -0.024889 -0.017351 -0.014385 0.188930 0.034611
polarizability: 1.50647303e+02 -8.23422108e+00 1.35610682e+02 -1.30714148e+01 -1.21338538e+01 1.05530027e+02
1716.lowfreq: -3.1683 -0.0002 0.0003 0.0005 8.2551 14.8391 29.4523 42.9943 59.8423
frequency: 28.8961 42.9603 59.8111 81.6349 123.0186 172.8827 193.1031 218.7249 236.6961 251.0828 293.4768 308.5702 314.0610 332.5247 354.6415 407.4573 421.7602 472.2784 503.6109 512.1553 615.7288 620.1909 699.4522 707.5906 727.2411 770.4568 777.5634 816.9377 845.3631 854.1503 915.4892 935.6503 948.2411 980.2031 990.8322 995.4091 1007.2616 1013.2087 1028.2369 1075.2483 1089.3085 1095.9925 1113.7229 1154.1293 1172.8168 1178.5181 1198.5122 1212.4115 1233.3353 1277.6290 1322.2796 1352.9791 1376.3091 1381.5857 1390.6754 1400.4952 1433.2175 1456.1401 1461.3335 1461.5164 1472.2070 1479.4802 1483.0364 1484.2495 1493.4974 1589.3299 1608.1608 1624.9291 2992.1074 2993.4648 2996.0496 3029.4441 3082.2708 3087.6328 3089.5512 3093.7508 3106.2431 3119.0739 3119.3561 3122.1222 3131.9660 3148.2463 3158.5073 3170.1669
redmass: 3.6072 3.2875 4.0187 4.2327 4.0758 1.5776 3.2388 1.3810 1.2333 2.9540 1.8037 2.3427 1.9914 2.7473 3.3573 2.8263 3.2166 3.8433 3.8772 3.5587 4.6287 4.5399 5.0924 1.8006 3.5368 2.3364 2.0396 1.5893 2.8900 1.2476 1.7409 1.6995 1.5269 1.3920 5.1748 1.3604 1.6996 1.8198 2.5314 2.3223 2.0260 2.1032 2.4595 1.6850 1.1892 2.5299 1.1569 2.7698 3.2380 1.1173 1.3643 1.2655 3.8798 1.3847 1.2317 1.1942 2.1999 1.0913 1.0489 1.0991 1.0522 1.0682 1.0962 1.7834 1.0696 5.9478 6.2585 8.8875 1.0362 1.0362 1.0360 1.0592 1.1006 1.0975 1.0995 1.1033 1.1001 1.0979 1.1056 1.0850 1.0888 1.0931 1.0963 1.0976
irintensity: 0.6772 0.1068 0.8152 0.7060 2.1814 2.4095 0.9809 0.1226 0.3360 0.3727 0.9471 3.9781 0.3323 3.3298 10.3797 0.0527 3.5743 0.8750 4.1137 11.7686 4.8013 7.1934 3.3670 59.7771 5.3090 4.2118 39.0875 3.8004 4.5269 0.2678 3.0406 5.9615 1.6426 0.5613 0.8076 0.3683 7.5992 30.4677 21.4904 196.9653 69.6134 2.2334 84.5465 17.3832 0.5164 1.0373 2.7583 30.3682 18.8476 2.6494 0.3450 0.6579 5.8270 17.6793 23.1152 16.6009 8.7947 17.1951 14.4656 1.1936 6.7865 7.0834 6.7425 46.0953 18.8080 1.2478 32.7913 132.3472 18.3907 18.8332 29.8305 36.7262 7.8008 37.6293 61.4636 1.8861 15.9194 24.0963 26.8146 0.2075 8.7868 24.9322 29.3041 11.5914
temp: 298.150 k
press: 1.00000 atm
elementType: 8 8 6 6 6 6 6 6 6 6 6 6 6 6 1 1 1 1 1 1 1 1 1 1 1 1 1 1 1 1
symmnumber: 1
zpe: 658493.7 jmol-1
zpe.correction: 0.250807 hartree
zpe.thermalcorrener: 0.265289 hartree
zpe.thermalcorrenthalpy: 0.266233 hartree
zpe.thermalcorrgfe: 0.208855 hartree
zpe.sumelectzpe: -616.269292 hartree
zpe.sumelectthermal: -616.254810 hartree
zpe.sumelectthermalent: -616.253866 hartree
zpe.sumelectthermalfe: -616.311243 hartree
dipole: -0.1741 -0.9411 1.4153
dipole: 1.7085
quadrupole: -75.8209 -77.4440 -88.8013
quadrupole: 3.5978 -5.8492 -0.1805
quadrupole: 4.8678 3.2448 -8.1126 3.5978 -5.8492 -0.1805
hfenergy: -616.5200987 hartree
pointgroup: C01 [X(C12H16O2)]
dipole: -0.1563759 -0.1634609 0.6329867 debye
polarizability: 152.5201829|-9.5499848|124.7526078|-4.7276347|-20.3320217|114.5152219 unknown
InChI: InChI=1S/C12H16O2/c1-4-14-11(13)12(2,3)10-8-6-5-7-9-10/h5-9H,4H2,1-3H3
charge 0 multiplicity 1
30 atoms
O  -2.376631 0.137025 0.450829
O  -1.879015 0.399129 -1.805441
C  -0.404461 1.474269 -0.108038
C  0.7398 0.472578 0.22291
C  -0.776942 2.289749 1.165387
C  -0.028793 2.458309 -1.242831
C  -1.607561 0.634352 -0.605698
C  0.577838 -0.469154 1.276157
C  1.963242 0.47002 -0.493252
C  1.609983 -1.371635 1.60942
C  2.999479 -0.433064 -0.160023
C  2.830021 -1.357219 0.893737
C  -3.52238 -0.753324 0.079154
C  -3.050435 -2.196384 -0.117841
H  -1.090466 1.639175 1.995543
H  -1.605306 2.988434 0.949036
H  0.100982 2.876708 1.489672
H  0.856553 3.053675 -0.957753
H  0.172056 1.932352 -2.190328
H  -0.864618 3.156322 -1.425044
H  -0.3666 -0.503172 1.829605
H  2.119906 1.170389 -1.318363
H  1.461858 -2.087342 2.426298
H  3.936938 -0.413746 -0.727612
H  3.632564 -2.057278 1.151727
H  -4.212196 -0.652315 0.932404
H  -3.988035 -0.355587 -0.839598
H  -3.921579 -2.849002 -0.314015
H  -2.364959 -2.268874 -0.978392
H  -2.534045 -2.571289 0.782651
