program: Gaussian 09
title: 000233225
version: EM64L-G09RevD.01
frameworkgroup: C1[X(C14H20N2O)]
method: RPBEPBE
basis: SDD
operation: Freq
keyword: #p
keyword: freq=noraman
keyword: PBEPBE/SDD
title: #p freq=noraman PBEPBE/SDD
converged: YES YES NO NO
title: Mulliken charges:
elementType: O N N C C C C C C C C C C C C C C H H H H H H H H H H H H H H H H H H H H
charge: -0.312384 -0.076692 -0.185451 -0.367731 -0.378504 -0.415795 -0.407687 -0.413404 0.337309 0.172115 -0.352532 -0.057523 -0.347383 -0.259289 -0.236253 -0.578050 -0.527055 0.217299 0.267537 0.220368 0.203837 0.182418 0.228627 0.207865 0.180325 0.188356 0.211875 0.244042 0.236991 0.245672 0.220679 0.226513 0.218122 0.218748 0.240856 0.226909 0.219267
chargesum: 0.00000
title: Mulliken charges with hydrogens summed into heavy atoms:
elementType: O N N C C C C C C C C C C C C C C
charge: -0.312384 -0.076692 -0.185451 0.043315 0.009687 0.069041 0.016518 -0.013173 0.337309 0.172115 -0.108491 0.179468 -0.101711 -0.038610 -0.009740 -0.141180 0.159978
polarizability: 2.34432276e+02 -1.75822529e+01 1.65384698e+02 -5.76202124e+00 3.54118195e-01 1.11060532e+02
1716.lowfreq: -7.9187 -0.0009 -0.0006 -0.0005 5.2954 6.3811 35.0170 59.7305 67.8904
frequency: 34.9704 59.7013 67.8874 84.9204 98.9283 110.9088 128.6220 151.5943 172.3369 215.4572 229.8637 246.1587 268.5537 307.1087 328.9708 352.4119 373.4924 395.4504 412.7470 467.8748 481.8496 491.6227 528.1430 547.4622 575.2469 611.8716 644.5435 697.9219 743.9488 753.8919 768.1460 783.4655 846.4539 853.4603 908.3500 918.6357 923.8004 932.2535 949.8698 950.6840 967.0494 991.9976 1008.3401 1019.0754 1041.3092 1056.8313 1057.1274 1090.1414 1096.9250 1113.6069 1131.1157 1136.7377 1150.5044 1153.2242 1166.1332 1176.5932 1182.3051 1204.2007 1229.9695 1243.1782 1266.0946 1274.0225 1285.9589 1297.4346 1328.7746 1342.6522 1349.9174 1357.6408 1371.9504 1380.3693 1384.8839 1417.3857 1428.3133 1442.1109 1450.8656 1455.3130 1456.0578 1459.2761 1466.2729 1472.2124 1481.7625 1487.8035 1570.8753 1607.9184 1659.4548 2841.1572 2845.3873 2859.9052 2902.4264 2925.1492 2963.1572 2984.1138 3025.1295 3045.8614 3047.8784 3055.8717 3080.5141 3084.7376 3104.6229 3112.4256 3127.5125 3143.5447 3156.4424 3168.8935 3195.3439
redmass: 4.3996 3.0848 3.4083 2.9784 2.7728 3.3712 2.6086 2.7334 1.1768 3.6469 3.4138 3.6656 2.0585 2.5213 3.7012 3.3028 2.8147 2.3330 2.4163 3.4886 3.2177 3.4347 2.8507 4.2770 3.5696 2.9509 1.7824 3.4737 3.6135 1.3463 4.3192 3.1057 1.5202 1.5025 2.0805 1.9999 2.4808 1.4683 5.1788 1.4216 1.3136 1.6805 2.2738 1.3027 2.1060 2.0966 1.8911 2.2291 2.0246 1.2601 2.6212 2.1360 1.4904 2.4519 1.3282 2.0767 2.2173 1.1131 1.4897 1.4364 1.4748 1.2866 1.3622 1.4213 1.3487 1.4252 1.6979 1.6692 2.4626 1.6994 1.4041 1.3310 1.2125 1.8443 1.0896 1.1079 1.0633 1.0842 1.1065 1.1094 1.0678 2.6242 6.4567 6.4394 4.7536 1.0705 1.0706 1.0688 1.0683 1.0700 1.0305 1.0875 1.0890 1.0910 1.0888 1.1042 1.0920 1.0601 1.0941 1.1019 1.0850 1.0894 1.0935 1.1002 1.1141
irintensity: 0.0301 0.1555 0.1604 0.2844 6.6689 0.5103 0.2031 3.8487 0.7443 0.8879 2.9400 7.8598 1.9875 16.6741 4.1755 3.9121 0.7355 1.4379 2.3504 3.5605 3.4069 6.8534 3.0670 4.4554 2.9383 5.0528 4.0053 8.3902 7.5070 76.9611 9.8368 16.7203 0.2319 0.6020 20.5930 2.9543 23.5862 2.1313 41.0535 87.5009 0.7305 2.2838 83.8898 5.2963 17.3831 10.6712 5.0767 13.8701 13.1112 4.5200 51.0461 22.2217 8.6106 24.1420 4.7825 19.2643 32.1159 10.7175 96.3995 54.1779 9.8195 1.3128 22.8298 21.2599 26.9278 6.7799 7.8600 10.0733 14.6079 20.2709 3.6562 3.3216 19.2548 10.4810 3.2516 46.5266 5.5400 2.5706 37.7824 0.1516 1.7892 137.4945 1.1267 44.7111 7.4757 43.4221 40.6547 171.4248 71.3772 96.6901 69.6818 25.5749 51.8753 43.1910 15.0910 29.4876 5.0761 13.0354 9.2254 24.3101 3.8585 14.7070 27.2477 17.2557 27.9392
temp: 298.150 k
press: 1.00000 atm
elementType: 8 7 7 6 6 6 6 6 6 6 6 6 6 6 6 6 6 1 1 1 1 1 1 1 1 1 1 1 1 1 1 1 1 1 1 1 1
symmnumber: 1
zpe: 824235.1 jmol-1
zpe.correction: 0.313935 hartree
zpe.thermalcorrener: 0.330651 hartree
zpe.thermalcorrenthalpy: 0.331595 hartree
zpe.thermalcorrgfe: 0.269471 hartree
zpe.sumelectzpe: -728.850916 hartree
zpe.sumelectthermal: -728.834200 hartree
zpe.sumelectthermalent: -728.833256 hartree
zpe.sumelectthermalfe: -728.895380 hartree
dipole: -1.4801 -0.6531 1.8192
dipole: 2.4345
quadrupole: -100.7149 -97.7216 -102.8990
quadrupole: -3.0921 0.0860 1.9105
quadrupole: -0.2697 2.7236 -2.4538 -3.0921 0.0860 1.9105
hfenergy: -729.1648508 hartree
pointgroup: C01 [X(C14H20N2O1)]
dipole: -0.5816693 0.2322463 -0.724634 debye
polarizability: 234.1855018|18.1622572|165.5747346|5.5960979|-1.1616044|111.11727 unknown
InChI: InChI=1S/C14H20N2O/c1-3-8-15-9-11-16(12-10-15)13-6-4-5-7-14(13)17-2/h3-7H,1,8-12H2,2H3
charge 0 multiplicity 1
37 atoms
O  1.824373 -2.133798 0.110283
N  -2.579442 0.60282 -0.115333
N  0.305378 0.342126 -0.175192
C  -1.923592 -0.66588 0.285256
C  -1.767286 1.29151 -1.143821
C  -0.514485 -0.394514 0.830299
C  -0.353668 1.590523 -0.613965
C  -3.991503 0.417336 -0.535041
C  1.71641 0.361291 0.016071
C  2.458294 -0.860019 0.160254
C  2.461065 1.576289 0.044317
C  -4.879793 0.010752 0.623051
C  3.847363 -0.84617 0.388531
C  3.859001 1.58332 0.241674
C  4.560917 0.373272 0.434865
C  -5.771013 -1.01101 0.596446
C  1.318681 -2.501849 -1.230369
H  -0.599218 0.211065 1.761001
H  -0.01101 -1.343764 1.071844
H  0.242145 2.047773 -1.424206
H  -0.433216 2.325258 0.221777
H  -1.854319 -1.373765 -0.581467
H  -2.533186 -1.150535 1.068396
H  -2.259762 2.246098 -1.409195
H  -1.677253 0.677897 -2.077726
H  -4.095107 -0.324583 -1.368105
H  -4.342791 1.39409 -0.927816
H  1.937643 2.53183 -0.057025
H  -4.772645 0.629934 1.525771
H  4.352784 -1.810461 0.507737
H  4.393441 2.539849 0.263767
H  5.642368 0.373919 0.606151
H  -6.413063 -1.236023 1.455423
H  -5.886627 -1.650204 -0.288358
H  0.581204 -1.7602 -1.589822
H  0.84604 -3.488866 -1.107805
H  2.159473 -2.573115 -1.946866
