program: Gaussian 09
title: 000233210
version: EM64L-G09RevD.01
frameworkgroup: C1[X(C12H16N2O3)]
method: RPBEPBE
basis: SDD
operation: Freq
keyword: #p
keyword: freq=noraman
keyword: PBEPBE/SDD
title: #p freq=noraman PBEPBE/SDD
converged: YES YES NO NO
title: Mulliken charges:
elementType: O O O N N C C C C C C C C C C C C H H H H H H H H H H H H H H H H
charge: -0.200537 -0.210354 -0.219665 -0.371964 -0.377905 0.055381 -0.054503 -0.398481 -0.567312 -0.739687 0.165197 0.178904 -0.381034 0.148631 -0.693818 0.237437 -0.517756 0.216972 0.200629 0.250788 0.274767 0.253565 0.223980 0.242579 0.225024 0.199799 0.198595 0.365558 0.366599 0.217424 0.211965 0.219870 0.279354
chargesum: 0.00000
title: Mulliken charges with hydrogens summed into heavy atoms:
elementType: O O O N N C C C C C C C C C C C C
charge: -0.200537 -0.210354 -0.219665 -0.006406 -0.011307 0.055381 0.162469 0.052936 -0.038980 -0.048104 0.165197 0.178904 0.017360 0.148631 -0.044559 0.237437 -0.238403
polarizability: 1.64555675e+02 3.19768551e+00 1.46629510e+02 8.98079028e-01 6.34099841e-01 1.32761098e+02
1716.lowfreq: -10.0430 -0.0009 -0.0007 -0.0001 6.9333 9.8741 33.8406 50.3692 62.9017
frequency: 33.6245 50.3288 62.8716 69.3727 84.5395 92.9108 131.5572 149.1471 162.9109 180.0621 201.3611 212.1241 236.6478 245.8764 270.5510 300.4731 315.9907 326.9967 356.8756 378.0486 386.2438 435.7921 487.0094 506.8241 539.6661 603.2961 627.1030 632.4450 650.7999 659.2803 673.9534 697.2722 742.5452 751.7789 752.3531 782.8502 838.2930 851.5488 876.5203 899.7382 934.6001 972.3334 993.1924 999.9911 1008.3966 1040.9655 1062.7924 1079.1077 1131.4090 1132.9814 1168.8693 1189.4271 1237.4217 1262.0316 1277.4956 1294.4209 1301.0977 1317.7613 1322.9350 1327.2274 1355.3248 1362.8909 1375.2347 1376.9435 1392.6063 1401.0582 1438.8710 1466.1963 1469.3610 1477.8713 1479.0858 1483.2714 1490.7126 1618.3624 1653.8081 1676.9019 2148.7191 2960.4235 2966.9565 2976.5362 2980.1354 2995.7924 3013.6396 3022.3538 3048.2770 3073.7226 3077.0236 3082.8955 3085.6912 3098.7149 3427.7504 3520.0587 3522.0691
redmass: 5.2282 4.9605 3.3718 2.0003 3.1525 4.0178 3.0610 5.3168 7.5819 3.0782 3.7032 1.3876 1.6541 2.1221 3.6241 4.3648 2.3988 3.5671 7.9703 3.3227 8.9386 2.8060 9.2530 4.5456 4.7792 7.4514 4.1591 1.2511 2.4373 1.2494 2.3488 5.8290 1.1254 2.0218 4.0381 1.6957 2.2659 1.5602 1.7200 3.3838 2.1736 3.4568 3.4093 1.5211 1.8819 2.7550 2.6593 2.3339 3.1141 2.5898 2.0540 3.5405 1.3454 1.4333 1.2980 1.4313 1.4858 1.3836 1.6697 1.4305 1.4352 8.3036 1.7536 1.7034 1.2102 1.1943 1.0901 1.0578 1.0619 1.0443 1.0618 1.0470 1.0826 7.0185 8.7520 5.5640 6.0241 1.0809 1.0598 1.0366 1.0635 1.0366 1.0983 1.0582 1.1015 1.1008 1.0996 1.1011 1.0990 1.0994 1.1597 1.0759 1.0781
irintensity: 0.1082 0.3514 0.0230 0.0435 0.2458 0.3271 0.7185 1.1355 11.4203 0.6878 0.0272 0.0698 0.0253 0.0327 0.6727 1.5670 7.9838 5.3855 25.0585 3.0641 2.5851 7.2952 14.0976 37.9909 0.9581 2.1127 9.4326 62.0627 1.9816 70.1862 33.6030 0.7881 6.0987 10.1249 5.2584 197.2548 0.5013 0.0556 4.0731 7.3863 4.4019 11.3496 9.2324 1.2385 6.2754 0.8797 3.9065 6.7487 38.8094 26.8964 2.7254 29.8689 1.7655 23.2606 41.3463 74.8740 30.1479 26.1315 105.5643 47.6067 25.6286 221.3299 5.7707 5.9486 11.3293 21.4333 22.0217 6.8838 3.8029 10.9232 4.3289 4.1294 22.8202 296.0672 98.7854 599.2325 4.9682 4.8474 10.1169 31.2582 61.3139 15.4994 10.4771 5.7762 11.2715 64.5586 42.2907 3.0987 27.9047 25.8182 68.3514 86.1713 45.5277
temp: 298.150 k
press: 1.00000 atm
elementType: 8 8 8 7 7 6 6 6 6 6 6 6 6 6 6 6 6 1 1 1 1 1 1 1 1 1 1 1 1 1 1 1 1
symmnumber: 1
zpe: 692825.0 jmol-1
zpe.correction: 0.263883 hartree
zpe.thermalcorrener: 0.281885 hartree
zpe.thermalcorrenthalpy: 0.282829 hartree
zpe.thermalcorrgfe: 0.217797 hartree
zpe.sumelectzpe: -800.750195 hartree
zpe.sumelectthermal: -800.732194 hartree
zpe.sumelectthermalent: -800.731249 hartree
zpe.sumelectthermalfe: -800.796281 hartree
dipole: 2.3590 -0.5448 0.8509
dipole: 2.5663
quadrupole: -99.0738 -109.2477 -106.8672
quadrupole: -4.3887 4.9516 -1.8772
quadrupole: 5.9891 -4.1848 -1.8043 -4.3887 4.9516 -1.8772
hfenergy: -801.0140781 hartree
pointgroup: C01 [X(C12H16N2O3)]
dipole: -0.9373229 0.1720765 0.3334849 debye
polarizability: 164.4923968|3.4507066|146.7020608|0.0653604|0.7233461|132.7518254 unknown
InChI: InChI=1S/C12H16N2O3/c1-4-6-8(3)12(7-5-2)9(15)13-11(17)14-10(12)16/h2,8,13-14H,4,6-7H2,1,3H3
charge 0 multiplicity 1
33 atoms
O  1.548031 -0.984756 2.056982
O  -0.198577 0.060587 -2.274865
O  2.477202 3.083659 0.021365
N  1.88615 1.08461 1.08423
N  1.048776 1.583919 -1.066082
C  0.121994 -0.411498 0.127838
C  -1.248833 0.137725 0.785109
C  -2.493482 -0.220951 -0.078227
C  0.033953 -1.934386 -0.191814
C  -1.436446 -0.335187 2.247036
C  1.246134 -0.170277 1.150474
C  0.318353 0.383266 -1.175447
C  -3.679139 0.748594 0.150108
C  1.841079 2.001406 0.018903
C  -4.921641 0.35241 -0.67623
C  1.272784 -2.475611 -0.776918
C  2.303921 -2.93425 -1.271393
H  -1.154121 1.245005 0.794985
H  -2.819735 -1.253015 0.162714
H  -2.241688 -0.207686 -1.155103
H  -0.797755 -2.093635 -0.899047
H  -0.191905 -2.47572 0.743866
H  -2.424521 -0.00094 2.609406
H  -0.673735 0.071882 2.931143
H  -1.404396 -1.435977 2.329221
H  -3.364184 1.775749 -0.125908
H  -3.949149 0.781717 1.224306
H  2.548746 1.308696 1.83399
H  1.084859 2.182868 -1.897494
H  -4.689115 0.333861 -1.757315
H  -5.283143 -0.654063 -0.393333
H  -5.751472 1.065406 -0.52029
H  3.202254 -3.339309 -1.700012
