program: Gaussian 09
title: 000233212
version: EM64L-G09RevD.01
frameworkgroup: C1[X(C15H10N2O4)]
method: RPBEPBE
basis: SDD
operation: Freq
keyword: #p
keyword: freq=noraman
keyword: PBEPBE/SDD
title: #p freq=noraman PBEPBE/SDD
converged: YES YES NO NO
title: Mulliken charges:
elementType: O O O O N N C C C C C C C C C C C C C C C H H H H H H H H H H
charge: -0.170558 -0.199246 -0.188378 -0.151824 -0.200920 0.007064 0.060965 0.210506 -0.566866 0.148573 0.104001 0.307191 0.486860 -0.379092 -0.347595 -0.188727 -0.373687 -0.378012 -0.231303 -0.231127 -0.232177 0.250821 0.247151 0.279408 0.281996 0.251716 0.259753 0.253709 0.230067 0.228599 0.231132
chargesum: 0.00000
title: Mulliken charges with hydrogens summed into heavy atoms:
elementType: O O O O N N C C C C C C C C C C C C C C C
charge: -0.170558 -0.199246 -0.188378 -0.151824 -0.200920 0.007064 0.060965 0.210506 -0.068894 0.148573 0.104001 0.307191 0.486860 -0.099684 -0.065599 0.062990 -0.113934 -0.124303 -0.001236 -0.002528 -0.001045
polarizability: 2.22613576e+02 -8.51192801e+00 2.07263759e+02 8.31437422e+00 6.42367317e+00 1.26471727e+02
1716.lowfreq: -12.5692 -6.3467 -5.8374 -0.0007 -0.0006 -0.0006 19.6367 31.0946 34.0249
frequency: 19.1910 31.0839 33.9870 52.3397 72.2416 100.9920 135.2023 169.1073 179.4085 199.8276 210.4011 265.7854 299.3491 326.4520 335.6670 346.3889 401.2413 403.2436 441.1257 453.6983 502.1749 535.5669 575.8195 586.7436 616.5442 619.3281 645.2226 675.0511 694.2346 706.7836 709.7902 740.3291 760.8713 770.6316 810.2135 819.3222 831.2282 848.8033 861.4144 931.2876 936.3954 946.3040 970.6044 984.8817 990.1863 1001.3387 1001.6626 1026.8564 1056.0246 1061.6553 1103.5809 1131.4069 1162.6818 1174.3661 1190.4978 1192.4872 1211.4172 1227.2988 1240.9704 1298.7095 1311.0195 1339.8192 1367.3795 1384.1317 1385.1190 1411.3839 1440.6621 1444.2623 1450.7306 1451.4768 1484.4122 1595.2125 1598.8342 1613.4323 1616.1263 1629.2339 1676.3358 3030.0947 3092.4545 3124.2504 3129.0531 3139.4982 3150.2625 3156.9352 3165.5221 3172.4997 3185.7613
redmass: 5.4215 6.0467 4.6450 12.1019 13.6462 7.4030 7.5159 8.1693 5.5586 5.5367 6.3470 8.9178 7.4440 8.4727 9.5707 1.9878 6.2362 2.9167 4.3961 4.9092 5.7596 6.5093 6.2336 8.1826 6.2976 5.3903 5.9780 6.1307 5.1341 1.9224 8.2341 5.6827 2.2858 3.5794 4.6548 3.4668 1.9381 6.0128 1.2437 2.6141 1.5214 1.4046 6.0905 1.3873 5.8433 1.3349 1.3738 2.2538 2.1964 2.2934 1.6829 5.0000 1.5636 1.0539 1.1662 1.9547 2.7748 9.6078 2.0916 1.7555 2.9105 1.2796 1.6240 9.8372 6.5323 4.1643 3.7696 2.1471 1.3166 2.2368 2.2170 6.0683 7.8062 6.0057 9.1880 11.4630 11.9815 1.0588 1.1052 1.0852 1.0881 1.0926 1.0966 1.0882 1.1017 1.0937 1.0984
irintensity: 0.4560 0.7757 0.8007 0.4654 0.9573 6.1554 0.6425 3.1869 0.0422 0.3871 1.3301 0.2250 2.5117 9.2372 4.3761 2.0805 2.9039 0.2628 0.2253 0.1091 13.7482 19.2338 4.8865 1.8271 0.0895 30.5922 0.1959 10.1116 26.9273 64.6969 19.5769 30.6707 28.0311 10.6662 7.7624 12.6608 26.0811 1.2151 1.2743 33.1972 5.2689 0.2721 6.2380 1.2620 0.2257 0.8137 1.6566 7.3773 7.9733 53.8623 1.5433 1.7437 11.6387 0.0029 1.4882 11.9345 10.8149 152.6478 1.3801 69.7212 218.6725 1.9484 56.8226 128.4446 4.3273 27.9366 14.4312 8.7148 25.1179 10.6500 14.7781 6.4080 3.2162 2.3802 106.9502 258.7106 32.1524 17.9654 0.3995 1.3688 0.7086 12.9745 25.0877 3.0261 22.3473 2.8732 2.9013
temp: 298.150 k
press: 1.00000 atm
elementType: 8 8 8 8 7 7 6 6 6 6 6 6 6 6 6 6 6 6 6 6 6 1 1 1 1 1 1 1 1 1 1
symmnumber: 1
zpe: 581225.5 jmol-1
zpe.correction: 0.221377 hartree
zpe.thermalcorrener: 0.238327 hartree
zpe.thermalcorrenthalpy: 0.239271 hartree
zpe.thermalcorrgfe: 0.173970 hartree
zpe.sumelectzpe: -986.482215 hartree
zpe.sumelectthermal: -986.465265 hartree
zpe.sumelectthermalent: -986.464321 hartree
zpe.sumelectthermalfe: -986.529622 hartree
dipole: -0.2224 4.2286 1.4055
dipole: 4.4616
quadrupole: -109.9820 -127.4021 -118.0176
quadrupole: 21.4039 0.4667 1.8873
quadrupole: 8.4852 -8.9349 0.4497 21.4039 0.4667 1.8873
hfenergy: -986.7035921 hartree
pointgroup: C01 [X(C15H10N2O4)]
dipole: -0.0277094 1.6520132 0.5926708 debye
polarizability: 222.0758044|-9.1879102|207.5291574|7.9234223|8.1049607|126.7441003 unknown
InChI: InChI=1S/C15H10N2O4/c18-14-11-7-4-8-12(17(20)21)13(11)15(19)16(14)9-10-5-2-1-3-6-10/h1-8H,9H2
charge 0 multiplicity 1
31 atoms
O  0.241094 -1.816141 -1.037795
O  -0.675847 2.780827 -0.690105
O  4.05609 -2.282123 1.024271
O  3.101959 -2.336347 -1.054088
N  -0.497678 0.43455 -1.044318
N  3.371396 -1.760292 0.060753
C  1.654348 0.089559 -0.207477
C  1.332158 1.460974 -0.048417
C  -1.849257 0.190047 -1.599271
C  0.451015 -0.604858 -0.807306
C  -0.040083 1.701258 -0.605698
C  2.903456 -0.360369 0.251706
C  -2.887257 -0.114037 -0.522043
C  2.206857 2.381338 0.546256
C  3.795182 0.536634 0.889119
C  3.449945 1.898919 1.02803
C  -3.102645 -1.44814 -0.093082
C  -3.642913 0.934924 0.05972
C  -4.060458 -1.728765 0.90688
C  -4.600821 0.653722 1.05967
C  -4.812309 -0.678863 1.484413
H  -1.75169 -0.656824 -2.299964
H  -2.123124 1.098454 -2.163313
H  1.921603 3.433538 0.638734
H  4.749294 0.154863 1.263174
H  4.154466 2.583075 1.510612
H  -2.512389 -2.258831 -0.536411
H  -3.472375 1.967912 -0.266614
H  -4.221731 -2.762379 1.232452
H  -5.18221 1.469605 1.503289
H  -5.55738 -0.897533 2.257624
