program: Gaussian 09
title: 000233228
version: EM64L-G09RevD.01
frameworkgroup: C1[X(C12H17Cl2NO2)]
method: RPBEPBE
basis: SDD
operation: Freq
keyword: #p
keyword: freq=noraman
keyword: PBEPBE/SDD
title: #p freq=noraman PBEPBE/SDD
converged: YES YES NO NO
title: Mulliken charges:
elementType: Cl Cl O O N C C C C C C C C C C C C H H H H H H H H H H H H H H H H H
charge: -0.059899 -0.058293 -0.303775 -0.302588 -0.191343 0.503628 -0.366177 -0.367130 -0.514312 -0.374172 -0.589564 -0.590402 0.214894 0.185599 -0.370808 -0.531081 -0.527498 0.248332 0.239636 0.240513 0.251836 0.257680 0.235852 0.262615 0.294504 0.295440 0.261985 0.247789 0.219715 0.258791 0.229612 0.221662 0.248144 0.228812
chargesum: 0.00000
title: Mulliken charges with hydrogens summed into heavy atoms:
elementType: Cl Cl O O N C C C C C C C C C C C C
charge: -0.059899 -0.058293 -0.303775 -0.302588 -0.191343 0.503628 0.121792 0.125219 -0.256632 -0.138320 -0.032445 -0.032976 0.214894 0.185599 -0.123019 0.177037 0.171119
polarizability: 2.30727600e+02 -3.64058321e+00 1.88626148e+02 -7.96602438e+00 -1.44356921e-01 9.97058685e+01
1716.lowfreq: -9.9728 -6.0492 -0.0023 -0.0017 -0.0015 3.4028 20.2789 34.8256 39.2156
frequency: 19.7503 34.7418 39.2018 41.6799 71.4044 90.8356 101.0384 115.5230 133.6036 150.9648 158.9385 161.2420 202.6583 204.8461 220.6335 241.3930 256.6216 269.6582 315.9608 350.3091 384.6370 413.2968 433.9835 486.3880 516.1362 544.2662 585.3202 640.0200 661.7293 679.3229 700.6084 716.3781 730.0982 778.2973 788.8691 803.5351 846.4114 856.2878 930.5282 942.1529 950.8455 980.2145 998.6585 1030.2709 1042.2616 1044.7108 1090.6968 1111.8195 1112.4385 1121.2692 1147.9757 1154.8775 1157.8978 1195.0555 1218.7957 1230.8318 1252.3826 1256.4615 1261.5439 1285.8660 1296.7600 1348.0017 1348.9172 1362.7925 1383.8169 1414.1432 1424.7760 1443.9185 1454.0359 1456.0142 1458.5427 1461.1257 1476.3107 1480.3288 1487.2102 1494.3697 1495.1010 1562.7642 1621.9295 2967.9737 2972.8666 3006.3930 3008.9961 3060.3964 3062.8205 3063.7630 3066.3301 3070.9927 3072.1187 3117.1844 3122.3644 3145.9677 3148.1407 3149.2788 3168.1151 3172.4152
redmass: 5.0153 7.8552 8.3090 7.7115 3.8207 2.9115 2.6910 2.4857 2.6133 1.2205 1.1476 2.7318 6.6854 4.6765 4.8044 5.1304 3.1707 5.3710 4.4792 4.6653 4.6544 5.0598 4.4888 3.4490 3.7325 4.2088 4.6504 3.7210 6.8099 5.5182 4.3350 5.2652 3.0809 1.1289 1.1995 1.5413 5.1449 1.6732 1.4676 4.5704 5.1387 2.7811 1.4562 4.1377 4.2683 1.4602 2.8616 1.2462 1.2473 1.4163 1.3688 1.3610 1.4732 1.6989 2.1706 2.4887 1.1613 1.1971 1.4725 1.3729 1.2935 1.4725 1.3742 5.3101 1.6087 1.8691 1.2058 1.5655 1.1170 1.0541 1.0877 1.0947 1.0573 1.0899 1.0539 1.7280 1.4894 7.1020 6.8717 1.0307 1.0314 1.0604 1.0623 1.0585 1.1041 1.0571 1.1005 1.1031 1.1019 1.1024 1.1031 1.1110 1.0904 1.1097 1.0914 1.0943
irintensity: 0.0170 1.1767 0.4902 0.2580 6.5814 2.0122 5.1252 3.5231 0.0210 1.2514 0.0817 5.2247 7.6622 5.3716 3.5519 4.8997 0.0294 9.7178 3.4183 2.2072 15.1653 3.1008 3.5348 5.4908 12.4582 6.6528 25.1677 10.9331 25.8466 77.0500 48.6350 18.5731 10.2116 5.1066 9.4236 39.3861 7.1515 35.3580 4.3495 25.4476 58.6244 74.7796 3.9533 0.0242 5.6812 3.5782 44.8783 15.3683 2.7519 48.7563 29.6930 2.5579 38.9732 49.2782 29.3100 169.7270 15.6196 5.7375 0.8123 8.6034 18.8946 26.9699 17.5980 16.4755 8.1555 1.7905 7.5015 5.1299 8.0808 20.3632 8.1105 23.3814 10.1238 10.8553 16.6066 176.9871 231.3914 26.9884 150.8767 83.0945 70.9549 13.6358 39.0447 10.2249 30.1185 26.0381 8.5403 25.9006 16.3316 30.3495 21.6556 5.5874 21.1463 13.2591 11.4193 8.8498
temp: 298.150 k
press: 1.00000 atm
elementType: 17 17 8 8 7 6 6 6 6 6 6 6 6 6 6 6 6 1 1 1 1 1 1 1 1 1 1 1 1 1 1 1 1 1
symmnumber: 1
zpe: 712442.7 jmol-1
zpe.correction: 0.271355 hartree
zpe.thermalcorrener: 0.290527 hartree
zpe.thermalcorrenthalpy: 0.291471 hartree
zpe.thermalcorrgfe: 0.220870 hartree
zpe.sumelectzpe: -1591.435737 hartree
zpe.sumelectthermal: -1591.416565 hartree
zpe.sumelectthermalent: -1591.415621 hartree
zpe.sumelectthermalfe: -1591.486223 hartree
dipole: -1.3405 -0.2155 -0.1991
dipole: 1.3723
quadrupole: -113.4149 -130.2067 -114.5884
quadrupole: 1.1142 -1.1402 5.3580
quadrupole: 5.9884 -10.8034 4.8149 1.1142 -1.1402 5.3580
hfenergy: -1591.7070925 hartree
pointgroup: C01 [X(C12H17Cl2N1O2)]
dipole: -0.5328312 -0.0452449 -0.0743811 debye
polarizability: 229.7816796|-7.7300832|189.1428317|-7.6105126|-6.0313806|100.1351045 unknown
InChI: InChI=1S/C12H17Cl2NO2/c1-16-11-4-3-10(9-12(11)17-2)15(7-5-13)8-6-14/h3-4,9H,5-8H2,1-2H3
charge 0 multiplicity 1
34 atoms
Cl 4.370186 -3.149679 0.705953
Cl 3.213648 3.782296 -0.199807
O  -2.649278 1.710768 -0.112443
O  -3.689148 -0.97309 0.479649
N  1.847077 -0.123173 -0.625684
C  0.475864 -0.321135 -0.318895
C  2.785273 -1.256611 -0.633458
C  2.361822 1.214929 -0.956762
C  -0.442437 0.770156 -0.317174
C  -0.03472 -1.616887 0.000315
C  3.28265 -1.602339 0.784775
C  2.664365 2.04415 0.308016
C  -1.811674 0.572704 -0.051136
C  -2.318209 -0.731128 0.209712
C  -1.408804 -1.806054 0.24757
C  -3.381714 2.017564 1.139356
C  -4.577495 -0.759096 -0.686503
H  2.313238 -2.148048 -1.085523
H  3.652893 -1.00246 -1.267224
H  3.288116 1.10854 -1.548265
H  1.6411 1.761637 -1.591722
H  -0.132267 1.799083 -0.517498
H  0.622418 -2.489243 0.044484
H  3.919943 -0.814935 1.213497
H  2.458766 -1.849496 1.469558
H  1.775847 2.182391 0.940666
H  3.497721 1.630317 0.894716
H  -1.798962 -2.804361 0.471243
H  -2.665863 2.291319 1.937647
H  -3.991863 1.155629 1.462394
H  -4.021282 2.880212 0.898318
H  -4.321852 -1.46823 -1.496954
H  -4.496437 0.278396 -1.060045
H  -5.597016 -0.958127 -0.321875
