program: Gaussian 09
title: 000233181
version: EM64L-G09RevD.01
frameworkgroup: C1[X(C10H14O2S)]
method: RPBEPBE
basis: SDD
operation: Freq
keyword: #p
keyword: freq=noraman
keyword: PBEPBE/SDD
title: #p freq=noraman PBEPBE/SDD
converged: YES YES NO NO
title: Mulliken charges:
elementType: S O O C C C C C C C C C C H H H H H H H H H H H H H H
charge: 0.280357 -0.284944 -0.239283 0.293350 0.030311 -0.385734 -0.341770 -0.099084 -0.721819 -0.715318 -0.285247 -0.144376 -0.524324 0.186638 0.199762 0.227119 0.232863 0.183973 0.214549 0.246696 0.235424 0.234765 0.201192 0.229872 0.245489 0.240741 0.258798
chargesum: 0.00000
title: Mulliken charges with hydrogens summed into heavy atoms:
elementType: S O O C C C C C C C C C C
charge: 0.280357 -0.284944 -0.239283 0.293350 0.216949 0.041146 0.075067 -0.099084 -0.025150 -0.049489 -0.039758 0.096365 -0.265527
polarizability: 1.62965100e+02 -1.22034094e+00 1.21727108e+02 3.17894254e+00 -1.09014976e+01 9.22758641e+01
1716.lowfreq: -12.3953 -0.0014 -0.0006 0.0008 7.7727 15.5965 17.3127 87.1796 93.1600
frequency: 15.6869 87.1696 93.1261 139.6956 185.3052 200.1250 221.1938 255.5246 282.0321 306.7802 312.6739 324.6502 375.9828 422.1401 467.4080 479.7337 525.9385 548.3608 589.9589 612.4479 683.9269 697.5038 701.6041 748.6155 773.6684 818.3632 832.1307 835.7439 869.3332 897.1477 906.4860 956.5487 971.6960 995.5444 1027.1734 1058.9058 1067.8250 1078.3364 1091.4091 1103.0010 1142.4471 1152.1976 1208.5008 1219.2350 1228.6782 1278.4393 1302.5967 1321.8402 1339.8263 1350.5763 1363.9359 1377.0087 1388.2598 1435.5805 1457.9160 1459.5582 1471.5135 1477.6106 1478.7246 1484.4113 1562.3501 2939.4036 2954.5780 2990.0686 2994.1462 3009.0455 3063.2559 3080.5077 3089.9579 3099.5413 3105.4981 3113.3999 3168.5202 3186.0982 3233.2187
redmass: 5.6923 4.3171 3.8484 3.0083 1.6024 1.0883 1.6722 3.5475 2.6683 3.6039 3.1073 3.5342 3.4445 4.4514 2.7111 3.9379 3.9839 3.0464 3.7815 7.2909 3.8036 3.0450 1.4471 3.2618 2.9570 3.5046 2.5021 1.4019 3.6023 2.9056 1.3856 1.6706 1.3554 2.6338 2.9839 1.7849 2.0293 2.1078 1.1409 3.2243 2.2898 1.8274 1.3964 1.5510 1.2703 2.9969 1.2776 1.2637 2.3611 1.2738 1.6077 1.2189 1.2526 1.0953 1.0491 1.0913 1.3188 2.3253 1.1284 1.0778 6.3332 1.0830 1.0684 1.0400 1.0561 1.0353 1.1003 1.0971 1.0993 1.1002 1.0984 1.1008 1.0895 1.0974 1.1003
irintensity: 0.1005 1.3647 3.2542 3.7377 1.2248 0.0332 2.0553 0.7286 0.8117 1.7691 0.5542 2.6310 0.3772 3.7849 1.8882 3.8217 3.3545 11.3017 0.5933 1.7936 2.9073 12.7765 90.8781 7.3064 68.8031 8.5225 4.4569 1.8039 25.7986 52.0988 0.6175 11.0795 9.3094 31.3826 13.6554 37.1493 66.0621 60.8401 2.0751 117.8984 1.4697 24.4271 9.9629 2.7995 16.5169 120.2158 5.8545 3.2829 9.6660 11.2521 16.4976 32.4114 22.3624 9.7180 13.6448 2.4841 19.2268 5.0576 7.7077 2.2676 11.8613 34.8359 78.5195 11.1313 47.2602 13.7429 28.2668 30.8961 33.1597 27.7571 34.9431 13.8384 7.0987 6.4556 1.9453
temp: 298.150 k
press: 1.00000 atm
elementType: 16 8 8 6 6 6 6 6 6 6 6 6 6 1 1 1 1 1 1 1 1 1 1 1 1 1 1
symmnumber: 1
zpe: 574741.9 jmol-1
zpe.correction: 0.218908 hartree
zpe.thermalcorrener: 0.231849 hartree
zpe.thermalcorrenthalpy: 0.232793 hartree
zpe.thermalcorrgfe: 0.179040 hartree
zpe.sumelectzpe: -936.936245 hartree
zpe.sumelectthermal: -936.923304 hartree
zpe.sumelectthermalent: -936.922360 hartree
zpe.sumelectthermalfe: -936.976113 hartree
dipole: 2.2156 1.2504 -0.7828
dipole: 2.6618
quadrupole: -69.4629 -82.2708 -87.6374
quadrupole: 1.2824 1.6860 -4.5293
quadrupole: 10.3275 -2.4804 -7.8470 1.2824 1.6860 -4.5293
hfenergy: -937.1551529 hartree
pointgroup: C01 [X(C10H14O2S1)]
dipole: 0.8344552 -0.2858766 0.564488 debye
polarizability: 163.1523018|1.221739|106.2500065|0.7475456|-18.2837202|107.565763 unknown
InChI: InChI=1S/C10H14O2S/c1-8-5-6-11-10(2,12-8)9-4-3-7-13-9/h3-4,7-8H,5-6H2,1-2H3
charge 0 multiplicity 1
27 atoms
S  -1.580236 0.966681 -1.354218
O  0.918925 0.835813 0.234669
O  0.650873 -1.433781 -0.619661
C  0.191814 -0.443321 0.391635
C  2.405019 0.723808 0.225506
C  2.833746 -0.280762 -0.862721
C  2.117585 -1.624254 -0.639574
C  -1.23819 -0.134623 0.03512
C  0.34262 -1.004385 1.820641
C  2.916945 2.146003 -0.002791
C  -2.413387 -0.630711 0.577798
C  -3.605755 -0.156389 -0.08134
C  -3.337685 0.702391 -1.135764
H  2.744775 0.356499 1.219759
H  3.931744 -0.424798 -0.834158
H  2.560188 0.12374 -1.854615
H  2.288469 -2.327867 -1.470346
H  2.463139 -2.102124 0.302527
H  1.398965 -1.198696 2.069229
H  -0.056826 -0.279877 2.549058
H  -0.206377 -1.956232 1.912807
H  2.55273 2.819138 0.792039
H  4.022195 2.163546 -0.003246
H  2.555396 2.530612 -0.972466
H  -2.434686 -1.321057 1.424268
H  -4.616893 -0.442189 0.218223
H  -4.036492 1.214332 -1.79538
