program: Gaussian 09
title: 000233199
version: EM64L-G09RevD.01
frameworkgroup: C1[X(C17H19ClN2)]
method: RPBEPBE
basis: SDD
operation: Freq
keyword: #p
keyword: freq=noraman
keyword: PBEPBE/SDD
title: #p freq=noraman PBEPBE/SDD
converged: YES YES NO NO
title: Mulliken charges:
elementType: Cl N N C C C C C C C C C C C C C C C C C H H H H H H H H H H H H H H H H H H H
charge: -0.079828 -0.091406 -0.174545 -0.373950 -0.353934 -0.406335 -0.383891 -0.487208 0.484857 0.447210 -0.361202 -0.366881 -0.376345 -0.448340 -0.221429 -0.222778 -0.118252 -0.228133 -0.220191 -0.244743 0.233017 0.193921 0.185842 0.209214 0.217083 0.214950 0.218462 0.203971 0.222689 0.194974 0.239069 0.222209 0.263460 0.232907 0.247809 0.248153 0.225622 0.225601 0.228373
chargesum: 0.00000
title: Mulliken charges with hydrogens summed into heavy atoms:
elementType: Cl N N C C C C C C C C C C C C C C C C C
charge: -0.079828 -0.091406 -0.174545 0.052987 0.041121 0.025699 0.038542 -0.069545 0.484857 0.447210 -0.122134 -0.144672 -0.112885 -0.215433 0.026379 0.025375 -0.118252 -0.002511 0.005411 -0.016371
polarizability: 3.11690521e+02 -9.56545030e+00 1.80582828e+02 -1.10486899e+01 -5.96147129e+00 1.33307987e+02
1716.lowfreq: -14.5475 -6.9606 -0.0024 -0.0018 -0.0014 8.6216 21.2525 32.8169 36.7688
frequency: 18.2022 32.6835 36.6088 50.3636 63.5470 90.6920 125.6030 175.0772 186.1539 205.6045 247.2233 257.7122 274.6019 312.8446 330.6271 333.7127 393.2544 405.9534 412.2592 433.3426 438.9511 463.5810 480.1857 508.4754 561.8978 600.5269 618.1130 625.3667 644.6871 695.6290 704.9146 731.2780 741.2655 784.5213 800.1693 806.9597 811.0505 844.8105 859.9108 912.4393 918.0617 926.0811 942.3229 945.0118 982.1388 982.5077 989.6816 996.4010 1002.7442 1009.1516 1026.9059 1054.0097 1060.9445 1076.8502 1081.1712 1094.9784 1118.6035 1136.1741 1149.5096 1170.2045 1174.3067 1179.9498 1196.5841 1205.3247 1213.7313 1231.3788 1243.8293 1276.9982 1300.6049 1301.3184 1314.2960 1338.5758 1344.0248 1355.6760 1360.0466 1372.5102 1376.3473 1382.4963 1397.5039 1413.2781 1441.3791 1453.9740 1454.7956 1460.9638 1465.1098 1473.7263 1483.8864 1490.8884 1571.3250 1595.2058 1609.6484 1615.4919 2846.9463 2853.3768 2865.8618 2912.3938 2923.6815 2987.7461 3031.2941 3050.2262 3054.2213 3088.2880 3113.0805 3123.7478 3136.5899 3147.5571 3148.1231 3154.3377 3162.4942 3169.2467 3177.1991
redmass: 5.7754 4.6431 3.7316 4.6796 3.4007 5.5388 5.3653 3.8237 6.0206 3.7476 2.8586 2.5242 3.5894 3.0696 3.1532 5.2841 2.0113 2.8447 2.9818 5.3869 3.6914 2.9490 3.2022 2.7828 3.7607 4.5446 6.3963 6.9750 2.7093 3.1568 2.1653 4.6623 1.5942 2.3138 1.4855 2.1444 2.7567 1.5793 1.2480 1.7614 2.3268 1.3742 1.3601 1.9408 2.9168 1.6002 5.5989 1.4221 2.5340 1.8034 2.0874 1.8274 2.0753 1.7127 2.5904 2.0952 1.4377 2.6449 3.0515 1.0645 2.0528 1.1279 1.1602 1.2309 2.1070 1.4577 1.4920 1.3749 1.3407 1.3538 1.3626 1.4660 1.3999 2.0695 1.5577 1.9756 2.0264 3.2037 1.8091 3.7285 2.0693 1.0911 1.0875 1.1180 1.1124 1.1593 2.0933 2.4902 7.2688 6.1866 6.2293 6.1860 1.0709 1.0714 1.0693 1.0688 1.0707 1.0866 1.0892 1.0905 1.0895 1.0894 1.0872 1.0861 1.0913 1.0956 1.0870 1.0882 1.1014 1.0962 1.0956
irintensity: 0.1635 0.0643 0.2864 0.9320 0.7913 0.3449 1.0399 9.6272 0.1759 0.5351 1.9283 1.9595 4.7473 7.3660 0.1268 8.7258 2.3960 0.3505 0.8680 12.1629 1.6242 2.8419 2.8706 24.0810 7.8326 3.4933 0.6769 0.2322 34.8741 3.2315 34.2942 9.6173 66.1151 13.4614 2.0687 46.7141 33.9877 3.7127 0.3228 1.6186 35.8593 0.3857 1.8873 3.8131 26.2876 3.7296 0.0290 3.8817 59.7217 5.9396 7.5227 4.8385 10.0440 10.5989 15.3884 8.3514 5.1754 65.0025 18.3600 0.7444 18.1113 3.1807 5.3182 5.9559 9.2645 125.5343 94.3932 23.4699 12.6717 10.2947 19.3053 5.5511 12.9124 7.3868 15.1305 9.9372 35.5692 13.6848 1.3109 0.6975 15.8520 2.4647 3.9545 44.2667 46.6403 14.5063 10.2436 258.5779 2.5428 1.0394 93.3874 4.5263 33.6814 46.4109 162.0279 58.2535 97.4896 20.8066 48.3192 25.7713 23.9921 22.8037 9.0145 0.0557 17.1374 34.5245 10.9857 7.7943 27.1552 15.0925 6.4242
temp: 298.150 k
press: 1.00000 atm
elementType: 17 7 7 6 6 6 6 6 6 6 6 6 6 6 6 6 6 6 6 6 1 1 1 1 1 1 1 1 1 1 1 1 1 1 1 1 1 1 1
symmnumber: 1
zpe: 841727.4 jmol-1
zpe.correction: 0.320597 hartree
zpe.thermalcorrener: 0.338308 hartree
zpe.thermalcorrenthalpy: 0.339252 hartree
zpe.thermalcorrgfe: 0.272436 hartree
zpe.sumelectzpe: -1227.295348 hartree
zpe.sumelectthermal: -1227.277636 hartree
zpe.sumelectthermalent: -1227.276692 hartree
zpe.sumelectthermalfe: -1227.343509 hartree
dipole: 4.2190 1.1559 -0.1754
dipole: 4.3780
quadrupole: -149.1736 -114.3975 -126.2796
quadrupole: -5.9707 -4.5667 -0.1251
quadrupole: -19.2234 15.5527 3.6707 -5.9707 -4.5667 -0.1251
hfenergy: -1227.6159447 hartree
pointgroup: C01 [X(C17H19Cl1N2)]
dipole: -1.6416801 -0.4223573 -0.3053812 debye
polarizability: 310.6725294|-12.3462859|171.3828468|16.1571661|18.8971919|143.5259596 unknown
InChI: InChI=1S/C17H19ClN2/c18-16-6-8-17(9-7-16)20-12-10-19(11-13-20)14-15-4-2-1-3-5-15/h1-9H,10-14H2
charge 0 multiplicity 1
39 atoms
Cl 7.328653 0.827118 0.66669
N  -1.43103 -0.950188 -0.23925
N  1.408999 -0.39947 -0.091007
C  -0.876335 0.320445 -0.758625
C  -0.443379 -2.036625 -0.426252
C  0.421221 0.697271 -0.02308
C  0.85276 -1.707622 0.331692
C  -2.759821 -1.275879 -0.811501
C  2.779347 -0.115784 0.123532
C  -3.857286 -0.323185 -0.346168
C  3.230926 1.197098 0.464504
C  3.775109 -1.130362 -0.035106
C  -3.908245 0.110011 1.003407
C  -4.865475 0.109146 -1.24203
C  4.6036 1.484911 0.621566
C  5.144792 -0.849769 0.130764
C  5.549741 0.459701 0.455154
C  -4.949231 0.954352 1.447245
C  -5.912391 0.951009 -0.799456
C  -5.957658 1.376222 0.547811
H  -1.618762 1.123921 -0.608731
H  -0.663606 0.246445 -1.85597
H  -0.203708 -2.195629 -1.508952
H  -0.864049 -2.977903 -0.025268
H  0.841932 1.592168 -0.513334
H  0.179421 0.958849 1.033182
H  0.631234 -1.692574 1.423246
H  1.586382 -2.507305 0.147306
H  -3.007525 -2.305622 -0.482309
H  -2.740749 -1.296314 -1.931325
H  2.516743 2.006331 0.636074
H  3.491372 -2.14754 -0.319887
H  -3.115104 -0.214317 1.686343
H  -4.831191 -0.21178 -2.291082
H  4.924234 2.496988 0.886357
H  5.887544 -1.641818 -0.004805
H  -4.976936 1.283248 2.492562
H  -6.68531 1.277715 -1.504455
H  -6.766025 2.031035 0.892358
