program: Gaussian 09
title: 000233173
version: EM64L-G09RevD.01
frameworkgroup: C1[X(C13H26O4)]
method: RPBEPBE
basis: SDD
operation: Freq
keyword: #pfreq=noraman
keyword: PBEPBE/SDD
title: #p freq=noraman PBEPBE/SDD
converged: NO YES NO NO
title: Mulliken charges:
elementType: O O O O C C C C C C C C C C C C C H H H H H H H H H H H H H H H H H H H H H H H H H H
charge: -0.253181 -0.287208 -0.273292 -0.277661 -0.421563 -0.405377 -0.009818 -0.396972 -0.316443 -0.256445 -0.244860 -0.381558 -0.254829 -0.246861 -0.323182 -0.242528 -0.692857 0.200186 0.213226 0.208960 0.227147 0.203884 0.212224 0.200882 0.252535 0.200798 0.236339 0.188257 0.175666 0.206909 0.184301 0.205199 0.187006 0.182796 0.171392 0.211109 0.231370 0.178261 0.175977 0.201984 0.211388 0.212727 0.204113
chargesum: 0.00000
title: Mulliken charges with hydrogens summed into heavy atoms:
elementType: O O O O C C C C C C C C C C C C C
charge: -0.253181 -0.287208 -0.273292 -0.277661 -0.008151 0.030730 0.194066 0.016134 0.136890 0.168151 0.137715 0.007942 0.114972 0.135639 0.086450 0.135432 -0.064629
polarizability: 1.69407791e+02 -4.36725841e+00 1.66754924e+02 3.60376980e+00 -3.79274533e-02 1.25505401e+02
1716.lowfreq: -23.5317 -6.0215 -0.0007 -0.0006 0.0002 5.4806 8.6255 15.9048 31.7512
frequency: -18.8002 15.2008 31.6676 41.8872 47.5215 67.3712 73.7430 121.3546 123.8219 136.1671 145.3375 179.0220 196.0571 202.4800 232.2476 249.4904 263.4072 268.3015 298.5936 322.8485 345.7314 379.1316 409.9842 468.7045 496.3391 503.0171 530.2664 554.0198 654.4682 733.5163 767.1795 782.7040 794.1010 797.1108 835.9969 839.2855 849.1393 872.3629 881.1023 914.6715 923.2588 938.5304 960.2191 966.8331 1003.2555 1014.8459 1030.4308 1039.5657 1041.4131 1054.3639 1061.6275 1069.0312 1085.6356 1104.0924 1106.9230 1113.8688 1125.8195 1127.6894 1145.2931 1174.8906 1182.5345 1197.5457 1207.4749 1214.2394 1241.0201 1250.9156 1256.0613 1259.3825 1269.9737 1289.1218 1301.1789 1305.9666 1327.3352 1337.2146 1341.8642 1346.1759 1347.6482 1354.3408 1361.4678 1367.9017 1376.9688 1390.4272 1396.0857 1415.4353 1445.5224 1449.9457 1450.8830 1456.7146 1457.7453 1459.8024 1463.5550 1471.7996 1474.6800 1477.8013 1480.9496 1483.9735 1485.7316 2903.8106 2910.1532 2915.4458 2929.0547 2951.8253 2958.4456 2967.5131 2970.4689 2973.5175 2979.4870 2980.8021 2981.1162 2983.6633 2988.0570 2994.9863 2999.0657 3006.1754 3026.5982 3042.4221 3043.3978 3046.2537 3056.0659 3065.7264 3070.2810 3071.6200 3084.0739
redmass: 3.7078 2.6320 3.8525 2.7326 4.3768 2.1574 4.5994 2.9888 3.1372 4.8095 3.2108 3.2405 2.2716 2.2910 1.1687 2.4984 2.2433 3.1413 2.6085 2.3605 2.5476 2.1184 3.7821 2.7405 2.6388 2.4155 2.9110 3.2180 2.9182 1.2098 4.2791 2.2037 2.2182 1.7874 1.9932 1.8294 2.7852 2.6687 1.6550 2.0122 2.1976 2.0051 1.4521 1.7742 2.7318 2.2561 3.0569 2.5882 2.7539 2.1036 2.7790 2.6151 2.4914 3.2660 1.9869 2.2720 1.9818 2.1640 1.8123 1.2869 1.4645 1.1209 1.1374 1.2427 1.2619 1.1151 1.2234 1.1270 1.2202 1.1240 1.2624 1.2672 1.2561 1.2097 1.4159 1.3001 1.4471 1.4031 1.5990 1.2618 1.3281 1.2154 1.4113 1.5850 1.0907 1.0827 1.0844 1.0878 1.0829 1.0857 1.0864 1.0877 1.0546 1.0425 1.0870 1.0814 1.0813 1.0553 1.0577 1.0590 1.0593 1.1015 1.0625 1.0457 1.0551 1.1019 1.0657 1.0995 1.0615 1.0803 1.1007 1.0618 1.0628 1.0681 1.0942 1.0985 1.1001 1.1003 1.1011 1.0987 1.1027 1.1009 1.1050
irintensity: 0.1787 0.2644 0.7121 0.0516 0.5209 0.2896 2.0939 7.9228 2.6291 4.5653 3.5695 10.8207 1.3464 1.2650 0.0955 10.9108 1.6596 2.1595 1.9424 2.3595 0.0377 0.5308 9.6413 11.4661 1.4948 3.0039 0.5368 1.1207 0.2804 4.7235 18.8041 5.1641 14.8159 17.2158 1.3247 7.7163 9.7565 16.7228 1.5400 67.3515 37.9712 68.6708 26.3965 43.8751 52.0789 15.0959 7.3017 10.6321 40.4692 38.0866 64.7934 59.6065 82.5980 16.5790 28.7930 20.3290 5.6386 17.2101 5.8312 6.8437 17.0234 4.6656 9.2634 3.9169 0.9323 2.1653 6.5845 5.8853 8.2923 0.5917 25.9891 0.8134 3.5427 41.1993 0.5873 14.6657 2.8302 0.4268 0.9358 0.9392 2.9573 13.1702 1.0998 1.0229 6.3159 9.9599 6.7982 8.1067 11.8015 9.5043 10.1066 6.3545 9.9162 11.3564 11.8197 6.4679 11.6906 35.5427 23.8408 53.1454 183.6903 50.0766 99.8218 41.3134 7.7325 41.6884 109.1396 50.6796 34.1756 54.2372 56.5612 45.3954 19.3810 73.5968 20.8883 31.6299 22.3063 6.4728 52.6395 57.9802 39.8187 90.7387 38.3737
temp: 298.150 k
press: 1.00000 atm
elementType: 8 8 8 8 6 6 6 6 6 6 6 6 6 6 6 6 6 1 1 1 1 1 1 1 1 1 1 1 1 1 1 1 1 1 1 1 1 1 1 1 1 1 1
symmnumber: 1
zpe: 991766.1 jmol-1
zpe.correction: 0.377744 hartree
zpe.thermalcorrener: 0.396783 hartree
zpe.thermalcorrenthalpy: 0.397727 hartree
zpe.thermalcorrgfe: 0.328121 hartree
zpe.sumelectzpe: -810.404244 hartree
zpe.sumelectthermal: -810.385205 hartree
zpe.sumelectthermalent: -810.384261 hartree
zpe.sumelectthermalfe: -810.453866 hartree
dipole: 1.2917 1.8640 -0.3185
dipole: 2.2901
quadrupole: -96.6724 -92.4228 -109.0278
quadrupole: 0.4381 5.4080 -0.2143
quadrupole: 2.7019 6.9515 -9.6534 0.4381 5.4080 -0.2143
hfenergy: -810.7819875 hartree
pointgroup: C01 [X(C13H26O4)]
dipole: -0.710534 -0.5467849 -0.0891949 debye
polarizability: 166.3280729|-4.3709098|169.5482666|-4.8947302|0.5445435|125.7917768 unknown
InChI: InChI=1S/C13H26O4/c1-2-3-7-14-9-10-15-11-12-17-13-6-4-5-8-16-13/h13H,2-12H2,1H3
charge 0 multiplicity 1
43 atoms
O  2.538391 -0.000868 1.357981
O  2.392961 -1.347885 -0.64989
O  -0.410545 -2.238083 0.150966
O  -2.801757 -0.38411 -0.124848
C  3.623655 0.711644 -0.772204
C  2.398624 1.596165 -1.101656
C  3.229321 -0.450648 0.151392
C  1.706258 2.050674 0.205618
C  1.333798 0.825605 1.058829
C  1.988414 -2.575904 0.05662
C  0.643929 -3.026855 -0.496639
C  -3.650878 1.885645 0.026103
C  -3.705466 0.48401 0.643535
C  -1.738293 -2.551241 -0.384161
C  -2.247497 2.525872 0.103833
C  -2.777889 -1.753463 0.38992
C  -2.199481 3.931636 -0.531047
H  4.392396 1.31205 -0.248753
H  4.078306 0.297733 -1.690208
H  2.71326 2.470739 -1.701205
H  1.684611 1.011526 -1.711518
H  4.11047 -0.993372 0.550212
H  0.790427 2.631013 -0.017455
H  2.387829 2.70758 0.781858
H  0.581823 0.192549 0.548777
H  0.955121 1.112212 2.053902
H  1.896476 -2.379596 1.141861
H  2.753776 -3.361966 -0.116584
H  0.489512 -4.110018 -0.282961
H  0.625058 -2.878655 -1.598121
H  -4.388445 2.52801 0.550117
H  -3.972246 1.820853 -1.032167
H  -4.741603 0.075328 0.606445
H  -3.382452 0.511205 1.709692
H  -1.945131 -3.640192 -0.26718
H  -1.798572 -2.293914 -1.463668
H  -1.529437 1.85253 -0.399357
H  -1.933883 2.584362 1.167136
H  -3.780932 -2.222089 0.261934
H  -2.519978 -1.765938 1.471556
H  -2.47724 3.892206 -1.601378
H  -1.186876 4.371578 -0.463138
H  -2.901317 4.623872 -0.027549
