program: Gaussian 09
title: 000233202
version: EM64L-G09RevD.01
frameworkgroup: C1[X(C16H15NO4)]
method: RPBEPBE
basis: SDD
operation: Freq
keyword: #p
keyword: freq=noraman
keyword: PBEPBE/SDD
title: #p freq=noraman PBEPBE/SDD
converged: YES YES NO NO
title: Mulliken charges:
elementType: O O O O N C C C C C C C C C C C C C C C C H H H H H H H H H H H H H H H
charge: -0.289430 -0.261214 -0.234554 -0.243392 0.096561 0.266520 -0.457080 0.471110 0.179236 0.548536 -0.503363 -0.341368 -0.410323 -0.393636 -0.387944 -0.285743 -0.226031 -0.225729 -0.228365 -0.210176 -0.491428 0.219204 0.221811 0.251187 0.261352 0.244535 0.236048 0.238060 0.279088 0.232681 0.232941 0.235004 0.264702 0.229536 0.251659 0.230004
chargesum: 0.00000
title: Mulliken charges with hydrogens summed into heavy atoms:
elementType: O O O O N C C C C C C C C C C C C C C C C
charge: -0.289430 -0.261214 -0.234554 -0.243392 0.096561 0.266520 -0.016065 0.471110 0.179236 0.548536 -0.252176 -0.080016 -0.165788 -0.157588 -0.149884 -0.006656 0.006651 0.007212 0.006640 0.054527 0.219770
polarizability: 3.56038498e+02 5.39739933e+01 2.35259490e+02 -1.01160646e+00 2.37908191e+00 1.24182475e+02
1716.lowfreq: -12.2949 -3.7849 -0.0009 -0.0007 -0.0004 2.7068 13.0260 24.4522 28.0254
frequency: 9.2808 24.2687 27.8304 35.7049 43.5048 70.2688 73.3119 93.5605 137.5088 141.7111 174.2357 195.3018 198.7962 221.8663 246.3382 272.3348 319.8462 343.9075 346.4786 393.1011 403.3355 453.2259 470.1218 488.5743 511.1182 544.0706 582.0598 596.2687 611.8665 616.7897 666.3104 671.1827 702.2965 727.2920 730.4122 751.6577 774.5680 820.1872 839.1571 840.5578 854.3484 854.7581 902.6039 936.1930 941.9147 948.8089 962.3292 977.1907 978.8527 988.8479 990.9777 1000.0079 1000.4375 1026.0107 1090.2826 1105.2962 1113.6351 1149.8539 1156.9564 1174.7667 1187.7887 1193.4132 1194.8682 1218.4422 1226.2150 1250.2140 1274.9310 1279.1124 1306.7842 1326.4264 1354.0175 1375.8327 1386.8279 1387.5001 1424.5335 1441.4224 1445.4277 1457.4635 1460.4897 1479.3245 1486.1702 1499.2494 1559.9832 1596.9530 1606.3629 1616.4518 1627.4243 2964.7912 3007.0301 3027.5233 3118.6869 3120.0993 3124.1002 3125.2479 3136.8088 3138.4524 3143.4688 3151.7766 3165.2796 3167.8240 3175.4300 3198.5205
redmass: 3.9818 3.8494 3.6762 6.8700 6.2713 6.9488 6.1787 4.2309 3.6522 5.7066 1.6122 4.3890 2.1360 7.7942 4.1597 4.1773 6.1094 2.3928 4.4960 3.9782 2.7956 2.9837 6.7372 3.8220 5.7646 6.6116 4.5080 3.9396 5.7064 6.3429 9.4816 6.0946 1.8997 3.3900 3.5667 3.2175 3.1047 1.5298 3.5457 1.6152 1.6155 1.2778 3.7773 2.0556 4.8329 1.3368 8.2589 1.5780 1.3931 3.2349 6.2109 1.2830 1.3241 2.1852 1.5057 1.2650 2.1019 1.8415 1.3933 1.0546 1.1397 1.1216 2.0342 2.6737 2.3760 2.0455 1.4241 2.4819 2.3699 1.2722 1.5247 4.0000 8.4041 3.7243 2.2368 2.1789 1.6919 1.0537 1.0641 1.1382 2.4229 2.7301 7.4597 6.1045 5.8531 6.1649 5.6826 1.0558 1.0290 1.1079 1.1041 1.0892 1.0868 1.0882 1.1061 1.0915 1.0896 1.0961 1.0901 1.1016 1.0957 1.0942
irintensity: 0.2822 0.8873 1.7847 1.2232 2.5076 8.4608 1.9152 1.7779 0.8680 0.4656 0.2684 2.5562 2.0100 1.4646 0.0809 3.4266 0.3646 1.9916 6.5250 2.6916 0.0080 2.7274 7.7315 12.1285 4.2301 7.7040 22.6007 11.4681 14.0977 0.0561 4.0979 0.4861 40.1221 2.3919 28.7564 17.1074 27.6763 53.8504 21.2042 12.1595 19.1984 2.2507 57.5612 2.8480 39.8971 6.0531 59.4068 2.1446 0.0619 90.2706 0.4444 44.3055 0.0280 4.2232 6.7008 4.5465 115.5037 82.7145 35.4963 0.0063 36.2163 35.8818 506.0028 579.1931 7.5485 210.5841 42.7138 101.5947 39.1951 0.3191 99.5069 128.6931 1.0750 86.3209 48.5405 9.4435 42.0946 18.5567 27.2410 23.8811 1.4470 230.2474 43.3970 0.8358 251.7095 1.9558 185.3203 21.9560 74.5634 21.0353 27.8393 0.2028 6.5604 3.4727 23.8001 11.2661 4.8348 32.9138 10.8723 20.4385 4.6236 11.2582
temp: 298.150 k
press: 1.00000 atm
elementType: 8 8 8 8 7 6 6 6 6 6 6 6 6 6 6 6 6 6 6 6 6 1 1 1 1 1 1 1 1 1 1 1 1 1 1 1
symmnumber: 1
zpe: 722263.0 jmol-1
zpe.correction: 0.275095 hartree
zpe.thermalcorrener: 0.294684 hartree
zpe.thermalcorrenthalpy: 0.295628 hartree
zpe.thermalcorrgfe: 0.222298 hartree
zpe.sumelectzpe: -972.715557 hartree
zpe.sumelectthermal: -972.695968 hartree
zpe.sumelectthermalent: -972.695024 hartree
zpe.sumelectthermalfe: -972.768354 hartree
dipole: 9.0626 2.5480 -0.3917
dipole: 9.4221
quadrupole: -149.6019 -130.1360 -117.5876
quadrupole: -24.9559 -1.3263 -1.6536
quadrupole: -17.1601 2.3059 14.8542 -24.9559 -1.3263 -1.6536
hfenergy: -972.9906521 hartree
pointgroup: C01 [X(C16H15N1O4)]
dipole: 3.5224636 1.1260305 -0.2565108 debye
polarizability: 351.9497059|58.0934329|238.9227221|-8.0040228|2.6296204|124.6080356 unknown
InChI: InChI=1S/C16H15NO4/c1-20-15-8-7-13(9-10-17(18)19)11-16(15)21-12-14-5-3-2-4-6-14/h2-11H,12H2,1H3
charge 0 multiplicity 1
36 atoms
O  1.205141 0.62905 -0.081241
O  0.72978 3.497816 0.028464
O  -5.075004 -3.344589 -0.053045
O  -6.214814 -1.360909 0.109556
N  -5.116246 -2.045883 0.019478
C  -0.114145 1.110104 -0.037877
C  1.404944 -0.847039 -0.121608
C  2.891274 -1.101211 -0.18674
C  -0.275434 2.541011 0.014049
C  -2.570185 0.826115 0.051202
C  -1.252395 0.283197 -0.026113
C  -1.585359 3.07447 0.102152
C  -2.712323 2.24099 0.122477
C  3.544187 -1.214254 -1.439716
C  3.653619 -1.217146 1.002715
C  -3.771185 0.003608 0.06525
C  4.937835 -1.435669 -1.504512
C  5.047494 -1.438269 0.941545
C  5.691974 -1.547721 -0.312977
C  -3.837039 -1.361283 -0.005513
C  2.126556 3.216369 -0.370488
H  0.886694 -1.251661 -1.013875
H  0.954989 -1.287893 0.790358
H  -1.126641 -0.802123 -0.063514
H  -1.679128 4.163105 0.148759
H  -3.713517 2.680778 0.186683
H  2.960116 -1.128693 -2.364168
H  3.154925 -1.132467 1.975843
H  -4.735165 0.525651 0.139068
H  5.433108 -1.52514 -2.477465
H  5.627855 -1.529175 1.866099
H  6.772296 -1.723702 -0.361567
H  -3.000641 -2.056426 -0.085732
H  2.164643 2.744011 -1.366172
H  2.624802 2.565364 0.363036
H  2.595892 4.211519 -0.397409
