program: Gaussian 09
title: 000233170
version: EM64L-G09RevD.01
frameworkgroup: C1[X(C15H20O4)]
method: RPBEPBE
basis: SDD
operation: Freq
keyword: #pfreq=noraman
keyword: PBEPBE/SDD
title: #p freq=noraman PBEPBE/SDD
converged: YES YES NO NO
title: Mulliken charges:
elementType: O O O O C C C C C C C C C C C C C C C H H H H H H H H H H H H H H H H H H H H
charge: -0.289984 -0.262759 -0.263173 -0.222286 -0.371176 -0.367210 -0.351687 -0.374236 -0.355895 -0.523078 -0.695803 0.209746 0.387684 0.226963 0.164816 -0.422520 -0.402835 -0.300948 -0.202763 0.192907 0.191349 0.189709 0.191478 0.187690 0.187192 0.227188 0.209543 0.195910 0.195425 0.244945 0.252593 0.209771 0.216075 0.209468 0.324912 0.260401 0.254894 0.241959 0.233738
chargesum: 0.00000
title: Mulliken charges with hydrogens summed into heavy atoms:
elementType: O O O O C C C C C C C C C C C C C C C
charge: -0.289984 -0.262759 -0.263173 -0.222286 0.013080 0.013977 0.023194 0.062495 0.035440 -0.025540 -0.060490 0.209746 0.387684 0.226963 0.164816 -0.097608 -0.142434 -0.046054 0.272934
polarizability: 2.72865922e+02 -6.83952976e+00 1.65736180e+02 5.12323127e+00 1.44490451e+00 1.06504248e+02
1716.lowfreq: -17.8301 -6.9528 -0.0015 -0.0012 0.0002 2.8350 6.3421 11.7147 25.3402
frequency: -14.8200 11.2313 25.0993 37.3690 50.2262 67.7603 74.2134 81.4352 99.0142 129.6887 135.1735 157.6008 170.0186 181.8807 226.9419 228.3529 261.3690 298.9286 334.3620 346.8857 410.5165 424.6014 427.4825 456.5510 509.1041 550.5452 592.4143 599.9142 675.3794 694.2119 712.4844 721.9829 727.4372 730.8527 758.9927 782.5242 809.2178 822.6401 835.7269 865.4043 888.6351 896.8301 905.6869 916.4721 928.0922 974.6807 992.1900 999.9387 1030.4457 1048.6959 1057.7527 1069.7360 1077.3892 1081.7235 1090.3072 1114.5892 1117.1246 1126.1664 1126.5325 1139.7957 1188.3052 1221.5291 1228.4444 1252.8385 1257.5295 1263.5087 1270.9072 1280.2537 1291.1103 1292.1069 1312.2573 1343.8089 1354.6089 1361.2658 1363.4481 1386.5133 1391.2875 1438.6127 1438.8749 1461.4159 1462.4985 1462.7864 1468.6772 1475.5907 1475.9732 1483.2931 1484.3018 1488.2557 1605.9028 1630.7294 1648.4132 2950.0013 2950.7689 2958.9876 2967.9146 2971.0163 2975.4388 2985.3609 2990.5009 2995.7482 3001.1293 3014.6003 3033.1003 3042.4737 3065.4733 3067.5810 3070.8001 3106.7123 3170.9252 3190.5173 3224.8964
redmass: 1.9283 5.1055 4.3797 6.4632 3.8008 1.9411 2.0718 3.5521 3.7697 1.9281 2.1598 5.1464 4.4409 7.0129 1.1226 6.6427 4.2128 8.7654 3.9461 7.0879 3.7141 3.3273 4.2480 3.5179 4.1596 3.6771 5.1617 5.2421 8.9389 5.9596 4.9494 1.0774 1.3891 3.1520 1.2021 6.2711 1.4011 1.2807 8.0712 7.8470 1.8865 1.3694 1.2831 4.8919 1.3358 5.5682 1.1871 4.3105 3.0910 3.0580 3.1668 1.4901 2.1132 2.4406 2.4535 1.7971 1.9339 1.6568 1.2264 1.7577 1.6963 1.3237 1.3670 1.8936 2.5316 1.3017 1.2947 1.0422 1.1247 1.1015 1.4033 1.5245 1.6661 1.6548 1.3019 1.2168 5.5512 4.4378 1.0851 2.5099 1.1009 1.0738 1.0746 1.0703 1.0478 1.0835 1.2160 1.0925 8.0144 8.9355 10.1462 1.0590 1.0587 1.0592 1.0587 1.0365 1.0656 1.0963 1.0646 1.0967 1.0602 1.1027 1.1028 1.0978 1.1003 1.1007 1.0993 1.1112 1.0890 1.0973 1.0938
irintensity: 0.0404 0.2699 0.6849 0.7867 1.6618 7.6256 5.9358 2.3543 0.5934 0.0762 0.0386 0.0395 4.0940 2.7273 0.0005 0.5259 0.7672 3.0370 7.1460 1.8716 8.7875 5.3393 2.7773 1.8139 2.9137 2.2225 3.9559 2.8839 0.1715 2.1267 1.1400 16.4333 0.6689 0.3108 5.4899 18.4496 50.9178 0.3515 38.9982 10.8614 5.4139 43.4251 1.8818 16.5970 0.3031 166.8452 0.6298 22.2488 51.1979 20.3397 5.2563 6.1103 125.5886 0.2213 247.5992 130.3246 166.5221 137.5252 24.5905 24.1355 1.5641 28.9265 14.0308 81.8340 32.4417 6.6427 20.4545 1.1968 0.4776 0.2687 26.2150 19.3068 0.9398 8.7132 1.8159 11.7391 5.2178 12.1479 22.8106 313.1267 10.5045 4.0271 0.2717 3.1260 10.6884 4.5099 22.9631 27.0487 9.9713 2.7479 172.5612 1.2147 3.9552 23.8726 109.4441 38.1054 3.9224 1.6321 37.5861 4.6415 128.0561 1.0343 52.4874 31.6662 28.2914 127.0253 54.4544 31.2835 3.4040 2.2334 14.3629
temp: 298.150 k
press: 1.00000 atm
elementType: 8 8 8 8 6 6 6 6 6 6 6 6 6 6 6 6 6 6 6 1 1 1 1 1 1 1 1 1 1 1 1 1 1 1 1 1 1 1 1
symmnumber: 1
zpe: 839941.9 jmol-1
zpe.correction: 0.319917 hartree
zpe.thermalcorrener: 0.339119 hartree
zpe.thermalcorrenthalpy: 0.340063 hartree
zpe.thermalcorrgfe: 0.268629 hartree
zpe.sumelectzpe: -883.019729 hartree
zpe.sumelectthermal: -883.000527 hartree
zpe.sumelectthermalent: -882.999583 hartree
zpe.sumelectthermalfe: -883.071017 hartree
dipole: -0.2705 1.4600 0.3797
dipole: 1.5326
quadrupole: -98.3709 -113.7490 -113.6323
quadrupole: -4.7378 2.7192 -0.4298
quadrupole: 10.2132 -5.1649 -5.0482 -4.7378 2.7192 -0.4298
hfenergy: -883.3396459 hartree
pointgroup: C01 [X(C15H20O4)]
dipole: -0.1091215 0.5902147 -0.0576327 debye
polarizability: 272.8928024|-4.110925|159.6072588|7.4039678|-18.0153348|112.6062891 unknown
InChI: InChI=1S/C15H20O4/c1-2-3-4-5-6-7-15(16)19-12-8-9-13-14(10-12)18-11-17-13/h8-10H,2-7,11H2,1H3
charge 0 multiplicity 1
39 atoms
O  0.718608 0.825088 -0.397054
O  4.925077 -1.758097 0.530436
O  6.269351 0.172857 0.053131
O  -0.09224 -1.299838 0.221738
C  -5.386736 -0.434459 0.340815
C  -4.191389 0.285156 -0.32333
C  -6.759322 0.083483 -0.144543
C  -2.826151 -0.26211 0.147252
C  -7.953454 -0.630447 0.529178
C  -1.643099 0.490065 -0.496301
C  -9.321774 -0.112735 0.035556
C  -0.296152 -0.131821 -0.169352
C  2.122638 0.594313 -0.253839
C  4.100229 -0.651043 0.207363
C  4.890774 0.482862 -0.072603
C  2.70595 -0.647781 0.129998
C  2.899941 1.740437 -0.539227
C  4.315413 1.697832 -0.452822
C  6.301974 -1.203894 0.618132
H  -5.314909 -1.523973 0.14095
H  -5.319256 -0.316221 1.442584
H  -4.269469 0.18133 -1.426264
H  -4.254112 1.372522 -0.107627
H  -6.832136 -0.04318 -1.245288
H  -6.830664 1.17479 0.047747
H  -2.746806 -1.338909 -0.093637
H  -2.753738 -0.186131 1.250144
H  -7.878901 -1.720926 0.340216
H  -7.881778 -0.500502 1.628476
H  -1.747849 0.48475 -1.601503
H  -1.625353 1.554474 -0.199804
H  -9.43095 -0.260662 -1.055603
H  -10.158045 -0.637724 0.532918
H  -9.432873 0.96922 0.23916
H  2.103772 -1.528239 0.347882
H  2.38686 2.661313 -0.827815
H  4.926334 2.575484 -0.675733
H  6.977557 -1.824894 0.009932
H  6.601479 -1.149586 1.681733
