program: Gaussian 09
title: 000233161
version: EM64L-G09RevD.01
frameworkgroup: C1[X(C11H16ClN3O3S)]
method: RPBEPBE
basis: SDD
operation: Freq
keyword: #p
keyword: freq=noraman
keyword: PBEPBE/SDD
title: #p freq=noraman PBEPBE/SDD
converged: YES YES NO NO
title: Mulliken charges:
elementType: Cl S O O O N N N C C C C C C C C C C C H H H H H H H H H H H H H H H H
charge: -0.065752 1.030261 -0.539160 -0.516241 -0.293138 -0.741393 -0.392829 -0.496960 -0.583259 -0.298218 -0.341938 0.596822 -0.682034 -0.357894 -0.444076 0.347553 -0.276116 -0.316870 0.158174 0.283362 0.281403 0.228278 0.237869 0.204297 0.204475 0.354899 0.218812 0.225187 0.217252 0.293460 0.237581 0.291956 0.326820 0.303728 0.303690
chargesum: 0.00000
title: Mulliken charges with hydrogens summed into heavy atoms:
elementType: Cl S O O O N N N C C C C C C C C C C C
charge: -0.065752 1.030261 -0.539160 -0.516241 -0.293138 -0.386494 -0.066009 0.110458 -0.018493 0.167929 0.066833 0.596822 -0.020783 -0.064434 -0.206495 0.347553 -0.276116 -0.024914 0.158174
polarizability: 2.88930500e+02 1.42528146e+01 1.92662724e+02 -1.03741050e+01 1.99312055e+01 1.26460624e+02
1716.lowfreq: -6.0572 -1.1425 -0.0014 0.0011 0.0018 3.3346 11.6637 16.8674 23.4084
frequency: 10.6844 16.8311 23.3252 37.6579 61.1937 66.5506 81.2904 83.2524 96.6333 114.0469 146.8643 158.9468 174.4773 184.7701 201.1665 214.4596 222.3459 230.0121 244.6503 261.5749 310.5699 311.4171 340.9503 360.8088 396.0607 401.4063 423.0423 447.5059 457.5961 502.9395 567.1374 584.7688 597.7574 626.9860 658.8963 680.3723 715.6808 746.7324 755.2455 784.7735 798.3929 817.9460 839.2986 846.3718 872.1960 892.4916 894.8674 899.5716 952.7477 995.8440 1010.0446 1025.8089 1066.6792 1077.3299 1083.9054 1101.0740 1137.3294 1196.6383 1200.7821 1223.7516 1232.4422 1262.8040 1274.0229 1276.3392 1287.8102 1297.7841 1309.2296 1320.5202 1345.8360 1371.8719 1392.5817 1408.3432 1420.7892 1465.9389 1472.0951 1476.8031 1477.3834 1487.0037 1489.1511 1535.0853 1576.5518 1614.8461 1678.5442 2977.3804 2981.8966 3000.6822 3024.5591 3041.1266 3064.1797 3081.8710 3083.7690 3134.2257 3138.0469 3159.1404 3165.6798 3377.4416 3489.9981 3498.1783 3539.2655
redmass: 5.4527 5.2404 6.0679 2.4202 3.3565 3.1757 7.6987 1.2625 4.5379 2.3360 5.7963 3.3560 5.5543 9.7505 6.9288 5.3267 4.7033 1.4504 3.0741 4.8201 7.4513 5.4427 5.1999 6.4645 3.5288 3.7816 1.8497 3.3703 6.8200 5.6025 3.5592 5.7762 1.3732 6.9921 5.5254 2.9375 5.4537 1.0717 4.1516 1.2064 1.7123 14.3751 1.7033 4.2112 1.6132 2.0327 5.1354 1.6464 2.6743 1.3373 3.9828 3.6660 2.6581 1.3045 3.0192 2.3026 1.4201 2.7785 1.5202 1.8101 1.2331 1.2974 2.5776 1.2240 1.1562 1.0680 1.2979 2.4412 1.4254 2.7662 1.2030 1.1139 3.6484 1.8807 1.0691 1.0420 1.0641 2.5608 1.0903 7.3914 7.2542 6.8190 1.0615 1.0582 1.0367 1.0591 1.1015 1.0563 1.1041 1.1017 1.0996 1.1103 1.0882 1.0956 1.0931 1.0430 1.0977 1.0775 1.0806
irintensity: 0.8266 0.1359 1.2445 1.6246 0.6594 0.4495 2.3169 38.7479 3.6408 0.1491 4.7847 8.1416 3.3386 2.2004 1.1358 0.4589 13.7931 2.4450 2.6005 2.5051 9.5804 5.6506 62.9376 12.5149 13.9082 34.0989 106.4830 2.6973 64.4683 43.3274 24.9686 2.5996 145.1061 40.6722 57.2369 1.4956 181.7756 8.6947 6.5938 1.9998 123.5820 92.3637 31.9616 12.2338 37.0243 31.0784 66.7956 7.6288 57.8864 1.7557 30.4439 6.4802 6.0726 7.8935 3.1778 32.6722 22.0696 4.7000 1.2517 69.3432 4.1943 31.3311 170.0806 10.8282 0.7667 0.9418 10.7727 118.7658 11.9523 11.0832 7.0497 4.3155 10.1718 402.5614 2.6097 14.6647 1.2205 7.2498 20.6916 37.4822 239.3074 302.1136 26.6125 25.8530 29.9676 16.0880 8.1557 9.2662 2.6573 59.4744 37.1355 2.5089 4.8747 10.9019 1.3748 0.3617 1.4333 62.4445 67.3998
temp: 298.150 k
press: 1.00000 atm
elementType: 17 16 8 8 8 7 7 7 6 6 6 6 6 6 6 6 6 6 6 1 1 1 1 1 1 1 1 1 1 1 1 1 1 1 1
symmnumber: 1
zpe: 696619.4 jmol-1
zpe.correction: 0.265328 hartree
zpe.thermalcorrener: 0.287398 hartree
zpe.thermalcorrenthalpy: 0.288342 hartree
zpe.thermalcorrgfe: 0.209838 hartree
zpe.sumelectzpe: -1675.182866 hartree
zpe.sumelectthermal: -1675.160796 hartree
zpe.sumelectthermalent: -1675.159852 hartree
zpe.sumelectthermalfe: -1675.238356 hartree
dipole: -2.9039 1.7303 -3.6837
dipole: 4.9996
quadrupole: -133.6720 -126.8118 -134.2378
quadrupole: -11.3928 14.4792 2.2021
quadrupole: -2.0981 4.7621 -2.6640 -11.3928 14.4792 2.2021
hfenergy: -1675.448194 hartree
pointgroup: C01 [X(C11H16Cl1N3O3S1)]
dipole: -1.2782158 1.3244172 -0.6936402 debye
polarizability: 284.2893225|30.9118331|151.7349216|-3.3011151|36.3119575|172.0296034 unknown
InChI: InChI=1S/C11H16ClN3O3S/c1-2-3-6-19(17,18)15-8-4-5-9(10(12)7-8)11(16)14-13/h4-5,7,14-15H,2-3,6,13H2,1H3
charge 0 multiplicity 1
35 atoms
Cl 1.627848 1.326432 2.069042
S  -2.745848 -1.303248 -0.358476
O  -3.697971 -2.337005 -1.171599
O  -2.374993 -1.544595 1.205311
O  4.856472 0.745138 -1.31703
N  -1.240534 -1.237231 -1.424755
N  4.406741 1.65482 0.754723
N  5.72344 2.181598 0.888422
C  -3.410766 0.510645 -0.556453
C  -4.555616 0.757318 0.422929
C  -5.061159 2.220846 0.304873
C  0.020093 -0.731672 -1.062506
C  -6.225936 2.49879 1.279527
C  0.250764 -0.060289 0.167417
C  1.098257 -0.857904 -1.986732
C  2.609417 0.410255 -0.474354
C  1.517194 0.49327 0.425674
C  2.342681 -0.2966 -1.685112
C  4.024295 0.943578 -0.371093
H  -3.699334 0.537742 -1.619392
H  -2.520096 1.132896 -0.368075
H  -5.391409 0.062468 0.214779
H  -4.214112 0.565745 1.457695
H  -5.391141 2.41772 -0.734482
H  -4.226189 2.919366 0.5123
H  -1.316226 -1.94594 -2.164568
H  -5.914959 2.337312 2.328018
H  -6.578434 3.541591 1.187258
H  -7.083424 1.831749 1.074732
H  -0.52286 -0.023097 0.938883
H  0.947911 -1.379955 -2.937932
H  3.182163 -0.373789 -2.384247
H  3.775079 1.840293 1.535059
H  6.408691 1.410362 0.893314
H  5.92586 2.811892 0.09735
